Gcc [trunk revision 216255] failed to bootstrap on i686!

H.J. Lu ia32 ia32@gnu-1.sc.intel.com
Wed Oct 15 12:37:00 GMT 2014


cd bld; \
 CC="gcc -m32" CXX="g++ -m32" ../src-trunk/configure \
	--with-arch=core2 --with-cpu=slm --prefix=/usr/5.0.0 --enable-clocale=gnu --with-system-zlib --enable-shared --with-demangler-in-ld i686-linux --with-fpmath=sse --enable-languages=c,c++,fortran,java,lto,objc
configure: WARNING: you should use --build, --host, --target
checking build system type... i686-pc-linux-gnu
checking host system type... i686-pc-linux-gnu
checking target system type... i686-pc-linux-gnu
    grep "Error " makelog.216255.trunk.i686.slm >> makelog.216255.trunk.i686.slm.mail; \
../../../src-trunk/libjava/jvmti.cc: In function ‘jvmtiError _Jv_JVMTI_AddToBootstrapClassLoaderSearch(jvmtiEnv*, const char*)’:
make[6]: *** [classpath/tools/libgcj_tools_la-tools.lo] Error 1
make[5]: *** [all-recursive] Error 1
make[4]: *** [all-target-libjava] Error 2
make[3]: *** [bootstrap] Error 2
make[2]: *** [bootstrap] Error 2
                 from ../../../../../src-trunk/libjava/classpath/../gnu/gcj/tools/gc_analyze/SymbolTable.java:196,
                 from ../../../../../src-trunk/libjava/classpath/../gnu/gcj/tools/gc_analyze/MemoryAnalyze.java:126,
                 from ../../../../../src-trunk/libjava/classpath/../gnu/gcj/tools/gc_analyze/MemoryMap.java:69,
                 from ../../../../../src-trunk/libjava/classpath/../gnu/gcj/tools/gc_analyze/MemoryAnalyze.java:36,
                 from ../../../../../src-trunk/libjava/classpath/../gnu/gcj/tools/gc_analyze/MemoryAnalyze.java:146,
                 from ../../../../../src-trunk/libjava/classpath/../gnu/gcj/tools/gc_analyze/MemoryMap.java:1,
                 from ../../../../../src-trunk/libjava/classpath/../gnu/gcj/tools/gc_analyze/ToolPrefix.java:43,
                 from ../../../../../src-trunk/libjava/classpath/../gnu/gcj/tools/gc_analyze/MemoryAnalyze.java:176,
                 from ../../../../../src-trunk/libjava/classpath/../gnu/gcj/tools/gc_analyze/BlockMap.java:1,
                 from ../../../../../src-trunk/libjava/classpath/../gnu/gcj/tools/gc_analyze/MemoryAnalyze.java:1,
                 from ../../../../../src-trunk/libjava/classpath/../gnu/gcj/tools/gc_analyze/MemoryMap.java:357,
                 from ../../../../../src-trunk/libjava/classpath/../gnu/gcj/tools/gc_analyze/MemoryAnalyze.java:137,
                 from ../../../../../src-trunk/libjava/classpath/../gnu/gcj/tools/gc_analyze/BlockMap.java:50,
                 from ../../../../../src-trunk/libjava/classpath/../gnu/gcj/tools/gc_analyze/BytePtr.java:114,
                 from ../../../../../src-trunk/libjava/classpath/../gnu/gcj/tools/gc_analyze/BlockMap.java:217,
                 from ../../../../../src-trunk/libjava/classpath/../gnu/gcj/tools/gc_analyze/MemoryAnalyze.java:170,
                 from ../../../../../src-trunk/libjava/classpath/../gnu/gcj/tools/gc_analyze/SymbolLookup.java:111,
                 from ../../../../../src-trunk/libjava/classpath/../gnu/gcj/tools/gc_analyze/ObjectMap.java:35,
                 from ../../../../../src-trunk/libjava/classpath/../gnu/gcj/tools/gc_analyze/ObjectMap.java:139,
                 from ../../../../../src-trunk/libjava/classpath/tools/com/sun/tools/javah/Main.java:58,
                 from com/sun/tools/doclets/Taglet.java:1,
                 from ../../../../../src-trunk/libjava/classpath/tools/com/sun/tools/javac/Messages.java:64,
                 from ../../../../../src-trunk/libjava/classpath/tools/com/sun/tools/javac/Main.java:157,
                 from com/sun/tools/javadoc/Main.java:45,
                 from com/sun/javadoc/TypeVariable.java:1,
                 from com/sun/javadoc/PackageDoc.java:1,
                 from com/sun/javadoc/ConstructorDoc.java:1,
                 from com/sun/javadoc/DocErrorReporter.java:1,
                 from com/sun/javadoc/RootDoc.java:0,
                 from com/sun/javadoc/Type.java:2,
                 from com/sun/javadoc/ThrowsTag.java:0,
                 from com/sun/javadoc/SerialFieldTag.java:1,
                 from com/sun/javadoc/SourcePosition.java:1,
                 from com/sun/javadoc/ClassDoc.java:1,
                 from com/sun/javadoc/ExecutableMemberDoc.java:2,
                 from com/sun/javadoc/Parameter.java:0,
                 from com/sun/javadoc/Tag.java:1,
                 from com/sun/javadoc/MethodDoc.java:0,
                 from com/sun/javadoc/ProgramElementDoc.java:2,
                 from com/sun/javadoc/Doc.java:0,
                 from com/sun/javadoc/FieldDoc.java:0,
                 from com/sun/javadoc/Doclet.java:95,
                 from com/sun/javadoc/MemberDoc.java:1,
                 from com/sun/javadoc/SeeTag.java:3,
                 from com/sun/javadoc/ParamTag.java:1,
                 from <built-in>:4:
../../../../../src-trunk/libjava/classpath/tools/external/asm/org/objectweb/asm/xml/ASMContentHandler.java:1018:0: note: non-delegitimized UNSPEC UNSPEC_GOTOFF (1) found in variable location

In method '_Jv_global_static_constructor()':
jc1: internal compiler error: Segmentation fault
0x861e0e1 crash_signal
	../../src-trunk/gcc/toplev.c:340
0x81ab9e2 put_decl_node
	../../src-trunk/gcc/java/lang.c:378
0x81abf7a lang_printable_name(tree_node*, int)
	../../src-trunk/gcc/java/lang.c:472
0x81ac0ff java_print_error_function
	../../src-trunk/gcc/java/lang.c:498
0x866d2dd diagnostic_report_current_function(diagnostic_context*, diagnostic_info*)
	../../src-trunk/gcc/tree-diagnostic.c:43
0x866d309 default_tree_diagnostic_starter
	../../src-trunk/gcc/tree-diagnostic.c:50
0x8ccfbb8 diagnostic_report_diagnostic(diagnostic_context*, diagnostic_info*)
	../../src-trunk/gcc/diagnostic.c:812
0x8ccfee9 inform(unsigned int, char const*, ...)
	../../src-trunk/gcc/diagnostic.c:941
0x82ae027 const_ok_for_output_1
	../../src-trunk/gcc/dwarf2out.c:11501
0x82b0767 const_ok_for_output
	../../src-trunk/gcc/dwarf2out.c:11582
0x82dc95c mem_loc_descriptor(rtx_def*, machine_mode, machine_mode, var_init_status)
	../../src-trunk/gcc/dwarf2out.c:12664
0x82dc7cd mem_loc_descriptor(rtx_def*, machine_mode, machine_mode, var_init_status)
	../../src-trunk/gcc/dwarf2out.c:12760
0x82cb827 gen_subprogram_die
	../../src-trunk/gcc/dwarf2out.c:18730
0x82d1401 gen_decl_die
	../../src-trunk/gcc/dwarf2out.c:20646
0x82d2bdf dwarf2out_function_decl
	../../src-trunk/gcc/dwarf2out.c:21086
0x8346d2a rest_of_handle_final
	../../src-trunk/gcc/final.c:4504
0x8346d2a execute
	../../src-trunk/gcc/final.c:4546
Please submit a full bug report,
with preprocessed source if appropriate.
Please include the complete backtrace with any bug report.
See <http://gcc.gnu.org/bugs.html> for instructions.
make[6]: *** [classpath/tools/libgcj_tools_la-tools.lo] Error 1
make[6]: Leaving directory `/export/gnu/import/git/gcc-test-ia32/bld/i686-linux/libjava'
make[5]: *** [all-recursive] Error 1
make[5]: Leaving directory `/export/gnu/import/git/gcc-test-ia32/bld/i686-linux/libjava'
make[4]: *** [all-target-libjava] Error 2
make[4]: Leaving directory `/export/gnu/import/git/gcc-test-ia32/bld'
make[3]: *** [bootstrap] Error 2
make[3]: Leaving directory `/export/gnu/import/git/gcc-test-ia32/bld'
10882.94user 293.45system 57:15.08elapsed 325%CPU (0avgtext+0avgdata 543312maxresident)k
264inputs+7585592outputs (0major+84873932minor)pagefaults 0swaps
make[2]: *** [bootstrap] Error 2
make[2]: Leaving directory `/export/gnu/import/git/gcc-test-ia32'



More information about the Gcc-regression mailing list