Gcc [trunk revision 216247] failed to bootstrap on x86_64!

H.J. Lu Intel64 intel64@gnu-13.sc.intel.com
Wed Oct 15 11:31:00 GMT 2014


cd bld; \
 RUNTESTFLAGS="--target_board='unix{-m32,}'" ../src-trunk/configure \
	--with-arch=corei7 --with-cpu=slm --prefix=/usr/5.0.0 --enable-clocale=gnu --with-system-zlib --enable-shared --with-demangler-in-ld --with-fpmath=sse --enable-languages=c,c++,fortran,java,lto,objc
checking build system type... x86_64-unknown-linux-gnu
checking host system type... x86_64-unknown-linux-gnu
checking target system type... x86_64-unknown-linux-gnu
checking for a BSD-compatible install... /bin/install -c
    grep "Error " makelog.216247.trunk.x86_64.slm >> makelog.216247.trunk.x86_64.slm.mail; \
../../../../src-trunk/libjava/jvmti.cc: In function ‘jvmtiError _Jv_JVMTI_AddToBootstrapClassLoaderSearch(jvmtiEnv*, const char*)’:
make[8]: *** [classpath/tools/libgcj_tools_la-tools.lo] Error 1
make[7]: *** [all-recursive] Error 1
make[6]: *** [multi-do] Error 1
make[5]: *** [all-multi] Error 2
make[4]: *** [all-target-libjava] Error 2
make[3]: *** [bootstrap] Error 2
make[2]: *** [bootstrap] Error 2
                 from gnu/classpath/tools/gjdoc/MethodDocImpl.java:63,
                 from gnu/classpath/tools/gjdoc/Parser.java:188,
                 from gnu/classpath/tools/gjdoc/ExecutableMemberDocImpl.java:425,
                 from gnu/classpath/tools/gjdoc/TextTagImpl.java:55,
                 from gnu/classpath/tools/gjdoc/TimerDoclet.java:46,
                 from gnu/classpath/tools/gjdoc/Main.java:1442,
                 from gnu/classpath/tools/gjdoc/Main.java:1276,
                 from gnu/classpath/tools/gjdoc/Parser.java:732,
                 from gnu/classpath/tools/gjdoc/ParameterImpl.java:68,
                 from gnu/classpath/tools/gjdoc/Parser.java:95,
                 from gnu/classpath/tools/gjdoc/TimerDoclet.java:65,
                 from gnu/classpath/tools/gjdoc/MemberDocImpl.java:234,
                 from gnu/classpath/tools/gjdoc/Main.java:1323,
                 from gnu/classpath/tools/gjdoc/Main.java:1498,
                 from gnu/classpath/tools/gjdoc/SeeTagImpl.java:215,
                 from gnu/classpath/tools/gjdoc/Main.java:1342,
                 from gnu/classpath/tools/gjdoc/Parser.java:515,
                 from ../../../../../../src-trunk/libjava/classpath/tools/gnu/classpath/tools/MalformedInputListener.java:3,
                 from ../../../../../../src-trunk/libjava/classpath/tools/gnu/classpath/tools/common/SecurityProviderInfo.java:97,
                 from ../../../../../../src-trunk/libjava/classpath/tools/gnu/classpath/tools/common/ProviderUtil.java:157,
                 from ../../../../../../src-trunk/libjava/classpath/tools/gnu/classpath/tools/common/ProviderUtil.java:129,
                 from ../../../../../../src-trunk/libjava/classpath/tools/gnu/classpath/tools/common/Persistent.java:49,
                 from ../../../../../../src-trunk/libjava/classpath/tools/gnu/classpath/tools/common/ClasspathToolParser.java:117,
                 from ../../../../../../src-trunk/libjava/classpath/tools/gnu/classpath/tools/common/ClasspathToolParser.java:197,
                 from ../../../../../../src-trunk/libjava/classpath/tools/gnu/classpath/tools/common/CallbackUtil.java:143,
                 from ../../../../../../src-trunk/libjava/classpath/tools/gnu/classpath/tools/common/ClasspathToolParser.java:235,
                 from ../../../../../../src-trunk/libjava/classpath/tools/gnu/classpath/tools/common/ProviderUtil.java:162,
                 from ../../../../../../src-trunk/libjava/classpath/tools/gnu/classpath/tools/common/Messages.java:64,
                 from ../../../../../../src-trunk/libjava/classpath/tools/gnu/classpath/tools/common/Persistent.java:59,
                 from ../../../../../../src-trunk/libjava/classpath/tools/gnu/classpath/tools/common/ClasspathToolParser.java:95,
                 from gnu/classpath/tools/taglets/GnuExtendedTaglet.java:2,
                 from gnu/classpath/tools/taglets/CodeTaglet.java:98,
                 from gnu/classpath/tools/taglets/ValueTaglet.java:127,
                 from gnu/classpath/tools/taglets/TagletContext.java:59,
                 from gnu/classpath/tools/taglets/DeprecatedTaglet.java:131,
                 from gnu/classpath/tools/taglets/SinceTaglet.java:160,
                 from gnu/classpath/tools/taglets/CopyrightTaglet.java:120,
                 from gnu/classpath/tools/taglets/VersionTaglet.java:152,
                 from gnu/classpath/tools/taglets/AuthorTaglet.java:292,
                 from gnu/classpath/tools/taglets/GenericTaglet.java:156,
                 from gnu/classpath/tools/taglets/AuthorTaglet.java:62,
                 from ../../../../../../src-trunk/libjava/classpath/tools/sun/rmi/rmic/Main.java:58,
                 from ../../../../../../src-trunk/libjava/classpath/tools/sun/rmi/rmic/Messages.java:64,
                 from <built-in>:3:
../../../../../../src-trunk/libjava/classpath/tools/external/asm/org/objectweb/asm/xml/ASMContentHandler.java:1018:0: note: non-delegitimized UNSPEC UNSPEC_GOTOFF (1) found in variable location

In method '_Jv_global_static_constructor()':
jc1: internal compiler error: Segmentation fault
0x9946af crash_signal
	../../src-trunk/gcc/toplev.c:340
0x58ecc9 put_decl_node
	../../src-trunk/gcc/java/lang.c:378
0x58f153 lang_printable_name(tree_node*, int)
	../../src-trunk/gcc/java/lang.c:472
0x58f299 java_print_error_function
	../../src-trunk/gcc/java/lang.c:498
0x9dc0d1 default_tree_diagnostic_starter
	../../src-trunk/gcc/tree-diagnostic.c:50
0xfdfd68 diagnostic_report_diagnostic(diagnostic_context*, diagnostic_info*)
	../../src-trunk/gcc/diagnostic.c:812
0xfe0154 inform(unsigned int, char const*, ...)
	../../src-trunk/gcc/diagnostic.c:941
0x67b665 const_ok_for_output_1
	../../src-trunk/gcc/dwarf2out.c:11501
0x67d865 const_ok_for_output
	../../src-trunk/gcc/dwarf2out.c:11582
0x6a68dd mem_loc_descriptor(rtx_def*, machine_mode, machine_mode, var_init_status)
	../../src-trunk/gcc/dwarf2out.c:12664
0x6a8144 mem_loc_descriptor(rtx_def*, machine_mode, machine_mode, var_init_status)
	../../src-trunk/gcc/dwarf2out.c:12760
0x696a31 gen_subprogram_die
	../../src-trunk/gcc/dwarf2out.c:18730
0x69bf61 gen_decl_die
	../../src-trunk/gcc/dwarf2out.c:20646
0x69d568 dwarf2out_function_decl
	../../src-trunk/gcc/dwarf2out.c:21086
0x704cfc rest_of_handle_final
	../../src-trunk/gcc/final.c:4504
0x704cfc execute
	../../src-trunk/gcc/final.c:4546
Please submit a full bug report,
with preprocessed source if appropriate.
Please include the complete backtrace with any bug report.
See <http://gcc.gnu.org/bugs.html> for instructions.
make[8]: *** [classpath/tools/libgcj_tools_la-tools.lo] Error 1
make[8]: Leaving directory `/export/gnu/import/git/gcc-test-intel64/bld/x86_64-unknown-linux-gnu/32/libjava'
make[7]: *** [all-recursive] Error 1
make[7]: Leaving directory `/export/gnu/import/git/gcc-test-intel64/bld/x86_64-unknown-linux-gnu/32/libjava'
make[6]: *** [multi-do] Error 1
make[6]: Leaving directory `/export/gnu/import/git/gcc-test-intel64/bld/x86_64-unknown-linux-gnu/libjava'
make[5]: *** [all-multi] Error 2
make[5]: Leaving directory `/export/gnu/import/git/gcc-test-intel64/bld/x86_64-unknown-linux-gnu/libjava'
make[4]: *** [all-target-libjava] Error 2
make[4]: Leaving directory `/export/gnu/import/git/gcc-test-intel64/bld'
make[3]: *** [bootstrap] Error 2
make[3]: Leaving directory `/export/gnu/import/git/gcc-test-intel64/bld'
16340.46user 479.89system 51:14.24elapsed 547%CPU (0avgtext+0avgdata 766456maxresident)k
296984inputs+13219256outputs (9256major+148134991minor)pagefaults 0swaps
make[2]: *** [bootstrap] Error 2
make[2]: Leaving directory `/export/gnu/import/git/gcc-test-intel64'



More information about the Gcc-regression mailing list