Gcc [trunk revision 216193] failed to bootstrap on x86_64!

H.J. Lu x32 x32@gnu-35.sc.intel.com
Tue Oct 14 11:21:00 GMT 2014


cd bld; \
 RUNTESTFLAGS="--target_board='unix{-mx32}'" ../src-trunk/configure \
	--with-arch=corei7 --with-cpu=slm --prefix=/usr/5.0.0 --enable-clocale=gnu --with-system-zlib --enable-shared --with-demangler-in-ld --with-multilib-list=m32,m64,mx32 --with-fpmath=sse --enable-languages=c,c++,fortran,java,lto,objc
checking build system type... x86_64-unknown-linux-gnu
checking host system type... x86_64-unknown-linux-gnu
checking target system type... x86_64-unknown-linux-gnu
checking for a BSD-compatible install... /bin/install -c
    grep "Error " makelog.216193.trunk.x86_64.slm.x32 >> makelog.216193.trunk.x86_64.slm.x32.mail; \
../../../../src-trunk/libjava/jvmti.cc: In function ‘jvmtiError _Jv_JVMTI_AddToBootstrapClassLoaderSearch(jvmtiEnv*, const char*)’:
make[8]: *** [classpath/tools/libgcj_tools_la-tools.lo] Error 1
make[7]: *** [all-recursive] Error 1
make[6]: *** [multi-do] Error 1
make[5]: *** [all-multi] Error 2
make[4]: *** [all-target-libjava] Error 2
make[3]: *** [bootstrap] Error 2
make[2]: *** [bootstrap] Error 2
                 from ../../../../../../src-trunk/libjava/classpath/tools/gnu/classpath/tools/rmiregistry/PersistentHashTable.java:81,
                 from ../../../../../../src-trunk/libjava/classpath/tools/gnu/classpath/tools/rmiregistry/Messages.java:64,
                 from ../../../../../../src-trunk/libjava/classpath/tools/gnu/classpath/tools/rmiregistry/Main.java:156,
                 from ../../../../../../src-trunk/libjava/classpath/tools/gnu/classpath/tools/rmiregistry/Main.java:120,
                 from ../../../../../../src-trunk/libjava/classpath/tools/gnu/classpath/tools/rmiregistry/RegistryImpl.java:136,
                 from ../../../../../../src-trunk/libjava/classpath/tools/gnu/classpath/tools/rmiregistry/Main.java:108,
                 from ../../../../../../src-trunk/libjava/classpath/tools/gnu/classpath/tools/rmiregistry/Main.java:141,
                 from ../../../../../../src-trunk/libjava/classpath/tools/gnu/classpath/tools/rmiregistry/Main.java:100,
                 from ../../../../../../src-trunk/libjava/classpath/tools/gnu/classpath/tools/native2ascii/Native2ASCII.java:119,
                 from ../../../../../../src-trunk/libjava/classpath/tools/gnu/classpath/tools/native2ascii/Native2ASCII.java:87,
                 from ../../../../../../src-trunk/libjava/classpath/tools/gnu/classpath/tools/native2ascii/Messages.java:64,
                 from ../../../../../../src-trunk/libjava/classpath/tools/gnu/classpath/tools/native2ascii/Native2ASCII.java:102,
                 from ../../../../../../src-trunk/libjava/classpath/tools/gnu/classpath/tools/native2ascii/Native2ASCII.java:109,
                 from ../../../../../../src-trunk/libjava/classpath/tools/gnu/classpath/tools/native2ascii/Native2ASCII.java:193,
                 from ../../../../../../src-trunk/libjava/classpath/tools/gnu/classpath/tools/FileSystemClassLoader.java:3,
                 from ../../../../../../src-trunk/libjava/classpath/tools/com/sun/tools/javah/Main.java:57,
                 from com/sun/tools/javadoc/Main.java:45,
                 from com/sun/tools/doclets/Taglet.java:1,
                 from ../../../../../../src-trunk/libjava/classpath/tools/com/sun/tools/javac/Main.java:157,
                 from ../../../../../../src-trunk/libjava/classpath/tools/com/sun/tools/javac/Messages.java:64,
                 from com/sun/javadoc/MemberDoc.java:1,
                 from com/sun/javadoc/SourcePosition.java:0,
                 from com/sun/javadoc/MethodDoc.java:1,
                 from com/sun/javadoc/SerialFieldTag.java:1,
                 from com/sun/javadoc/Parameter.java:1,
                 from com/sun/javadoc/TypeVariable.java:1,
                 from com/sun/javadoc/DocErrorReporter.java:1,
                 from com/sun/javadoc/Doc.java:0,
                 from com/sun/javadoc/ClassDoc.java:0,
                 from com/sun/javadoc/Doclet.java:95,
                 from com/sun/javadoc/ProgramElementDoc.java:1,
                 from com/sun/javadoc/ConstructorDoc.java:0,
                 from com/sun/javadoc/Type.java:1,
                 from com/sun/javadoc/ThrowsTag.java:1,
                 from com/sun/javadoc/PackageDoc.java:1,
                 from com/sun/javadoc/SeeTag.java:1,
                 from com/sun/javadoc/ParamTag.java:1,
                 from com/sun/javadoc/FieldDoc.java:1,
                 from com/sun/javadoc/ExecutableMemberDoc.java:1,
                 from com/sun/javadoc/RootDoc.java:3,
                 from com/sun/javadoc/Tag.java:3,
                 from ../../../../../../src-trunk/libjava/classpath/tools/sun/rmi/rmic/Main.java:58,
                 from ../../../../../../src-trunk/libjava/classpath/tools/sun/rmi/rmic/Messages.java:64,
                 from <built-in>:3:
../../../../../../src-trunk/libjava/classpath/tools/external/asm/org/objectweb/asm/xml/ASMContentHandler.java:1018:0: note: non-delegitimized UNSPEC UNSPEC_GOTOFF (1) found in variable location

In method '_Jv_global_static_constructor()':
jc1: internal compiler error: Segmentation fault
0x99528f crash_signal
	../../src-trunk/gcc/toplev.c:340
0x58ec19 put_decl_node
	../../src-trunk/gcc/java/lang.c:378
0x58f0a3 lang_printable_name(tree_node*, int)
	../../src-trunk/gcc/java/lang.c:472
0x58f1e9 java_print_error_function
	../../src-trunk/gcc/java/lang.c:498
0x9dcc41 default_tree_diagnostic_starter
	../../src-trunk/gcc/tree-diagnostic.c:50
0xfe0278 diagnostic_report_diagnostic(diagnostic_context*, diagnostic_info*)
	../../src-trunk/gcc/diagnostic.c:812
0xfe0664 inform(unsigned int, char const*, ...)
	../../src-trunk/gcc/diagnostic.c:941
0x67b625 const_ok_for_output_1
	../../src-trunk/gcc/dwarf2out.c:11501
0x67d825 const_ok_for_output
	../../src-trunk/gcc/dwarf2out.c:11582
0x6a689d mem_loc_descriptor(rtx_def*, machine_mode, machine_mode, var_init_status)
	../../src-trunk/gcc/dwarf2out.c:12664
0x6a8104 mem_loc_descriptor(rtx_def*, machine_mode, machine_mode, var_init_status)
	../../src-trunk/gcc/dwarf2out.c:12760
0x6969f1 gen_subprogram_die
	../../src-trunk/gcc/dwarf2out.c:18730
0x69bf21 gen_decl_die
	../../src-trunk/gcc/dwarf2out.c:20646
0x69d528 dwarf2out_function_decl
	../../src-trunk/gcc/dwarf2out.c:21086
0x704c7c rest_of_handle_final
	../../src-trunk/gcc/final.c:4504
0x704c7c execute
	../../src-trunk/gcc/final.c:4546
Please submit a full bug report,
with preprocessed source if appropriate.
Please include the complete backtrace with any bug report.
See <http://gcc.gnu.org/bugs.html> for instructions.
make[8]: *** [classpath/tools/libgcj_tools_la-tools.lo] Error 1
make[8]: Leaving directory `/export/gnu/import/git/gcc-test-x32/bld/x86_64-unknown-linux-gnu/32/libjava'
make[7]: *** [all-recursive] Error 1
make[7]: Leaving directory `/export/gnu/import/git/gcc-test-x32/bld/x86_64-unknown-linux-gnu/32/libjava'
make[6]: *** [multi-do] Error 1
make[6]: Leaving directory `/export/gnu/import/git/gcc-test-x32/bld/x86_64-unknown-linux-gnu/libjava'
make[5]: *** [all-multi] Error 2
make[5]: Leaving directory `/export/gnu/import/git/gcc-test-x32/bld/x86_64-unknown-linux-gnu/libjava'
make[4]: *** [all-target-libjava] Error 2
make[4]: Leaving directory `/export/gnu/import/git/gcc-test-x32/bld'
make[3]: *** [bootstrap] Error 2
make[3]: Leaving directory `/export/gnu/import/git/gcc-test-x32/bld'
18503.66user 531.30system 1:05:49elapsed 481%CPU (0avgtext+0avgdata 767068maxresident)k
797792inputs+15562720outputs (9702major+190966188minor)pagefaults 0swaps
make[2]: *** [bootstrap] Error 2
make[2]: Leaving directory `/export/gnu/import/git/gcc-test-x32'



More information about the Gcc-regression mailing list