Gcc [trunk revision 218030] failed to profiledbootstrap on x86_64!

H.J. Lu Intel64 LTO/FDO intel64profiled@gnu-mic-1.sc.intel.com
Mon Nov 24 23:56:00 GMT 2014


cd bld; \
 RUNTESTFLAGS="--target_board='unix{-m32,}'" ../src-trunk/configure \
	 --prefix=/usr/5.0.0 --enable-clocale=gnu --with-system-zlib --enable-shared --with-demangler-in-ld --with-build-config=bootstrap-lto --disable-werror --with-fpmath=sse --enable-languages=c,c++,fortran,java,lto,objc
checking build system type... x86_64-unknown-linux-gnu
checking host system type... x86_64-unknown-linux-gnu
checking target system type... x86_64-unknown-linux-gnu
checking for a BSD-compatible install... /bin/install -c
    grep "Error " makelog.218030.trunk.x86_64 >> makelog.218030.trunk.x86_64.mail; \
make[6]: *** [build/gengtype] Error 1
make[5]: *** [all-stagefeedback-gcc] Error 2
make[4]: *** [stagefeedback-bubble] Error 2
make[3]: *** [profiledbootstrap] Error 2
make[2]: *** [profiledbootstrap] Error 2
	mv -f doc/jcf-dump.1.T$$ doc/jcf-dump.1) || \
	(rm -f doc/jcf-dump.1.T$$ && exit 1)
echo timestamp > doc/gij.1
(pod2man --center="GNU" --release="gcc-5.0.0" --date=2014-11-24 --section=1 gij.pod > doc/gij.1.T$$ && \
	mv -f doc/gij.1.T$$ doc/gij.1) || \
	(rm -f doc/gij.1.T$$ && exit 1)
echo timestamp > doc/jv-convert.1
(pod2man --center="GNU" --release="gcc-5.0.0" --date=2014-11-24 --section=1 jv-convert.pod > doc/jv-convert.1.T$$ && \
	mv -f doc/jv-convert.1.T$$ doc/jv-convert.1) || \
	(rm -f doc/jv-convert.1.T$$ && exit 1)
echo timestamp > doc/grmic.1
(pod2man --center="GNU" --release="gcc-5.0.0" --date=2014-11-24 --section=1 grmic.pod > doc/grmic.1.T$$ && \
	mv -f doc/grmic.1.T$$ doc/grmic.1) || \
	(rm -f doc/grmic.1.T$$ && exit 1)
echo timestamp > doc/gcj-dbtool.1
(pod2man --center="GNU" --release="gcc-5.0.0" --date=2014-11-24 --section=1 gcj-dbtool.pod > doc/gcj-dbtool.1.T$$ && \
	mv -f doc/gcj-dbtool.1.T$$ doc/gcj-dbtool.1) || \
	(rm -f doc/gcj-dbtool.1.T$$ && exit 1)
echo timestamp > doc/gc-analyze.1
(pod2man --center="GNU" --release="gcc-5.0.0" --date=2014-11-24 --section=1 gc-analyze.pod > doc/gc-analyze.1.T$$ && \
	mv -f doc/gc-analyze.1.T$$ doc/gc-analyze.1) || \
	(rm -f doc/gc-analyze.1.T$$ && exit 1)
echo timestamp > doc/aot-compile.1
(pod2man --center="GNU" --release="gcc-5.0.0" --date=2014-11-24 --section=1 aot-compile.pod > doc/aot-compile.1.T$$ && \
	mv -f doc/aot-compile.1.T$$ doc/aot-compile.1) || \
	(rm -f doc/aot-compile.1.T$$ && exit 1)
echo timestamp > doc/rebuild-gcj-db.1
(pod2man --center="GNU" --release="gcc-5.0.0" --date=2014-11-24 --section=1 rebuild-gcj-db.pod > doc/rebuild-gcj-db.1.T$$ && \
	mv -f doc/rebuild-gcj-db.1.T$$ doc/rebuild-gcj-db.1) || \
	(rm -f doc/rebuild-gcj-db.1.T$$ && exit 1)
/export/gnu/import/git/gcc-test-profiled/bld/./prev-gcc/xg++ -B/export/gnu/import/git/gcc-test-profiled/bld/./prev-gcc/ -B/usr/5.0.0/x86_64-unknown-linux-gnu/bin/ -nostdinc++ -B/export/gnu/import/git/gcc-test-profiled/bld/prev-x86_64-unknown-linux-gnu/libstdc++-v3/src/.libs -B/export/gnu/import/git/gcc-test-profiled/bld/prev-x86_64-unknown-linux-gnu/libstdc++-v3/libsupc++/.libs  -I/export/gnu/import/git/gcc-test-profiled/bld/prev-x86_64-unknown-linux-gnu/libstdc++-v3/include/x86_64-unknown-linux-gnu  -I/export/gnu/import/git/gcc-test-profiled/bld/prev-x86_64-unknown-linux-gnu/libstdc++-v3/include  -I/export/gnu/import/git/gcc-test-profiled/src-trunk/libstdc++-v3/libsupc++ -L/export/gnu/import/git/gcc-test-profiled/bld/prev-x86_64-unknown-linux-gnu/libstdc++-v3/src/.libs -L/export/gnu/import/git/gcc-test-profiled/bld/prev-x86_64-unknown-linux-gnu/libstdc++-v3/libsupc++/.libs -c   -g -O2 -flto=jobserver -frandom-seed=1 -fprofile-use -DIN_GCC    -fno-exceptions -fno-rtti -fasynchronous-unwind-tables -W -Wall -Wno-narrowing -Wwrite-strings -Wcast-qual -Wmissing-format-attribute -Woverloaded-virtual -pedantic -Wno-long-long -Wno-variadic-macros -Wno-overlength-strings -fno-common  -DHAVE_CONFIG_H -DGENERATOR_FILE -I. -Ibuild -I../../src-trunk/gcc -I../../src-trunk/gcc/build -I../../src-trunk/gcc/../include  -I../../src-trunk/gcc/../libcpp/include  \
	-o build/genmddeps.o ../../src-trunk/gcc/genmddeps.c
/export/gnu/import/git/gcc-test-profiled/bld/./prev-gcc/xg++ -B/export/gnu/import/git/gcc-test-profiled/bld/./prev-gcc/ -B/usr/5.0.0/x86_64-unknown-linux-gnu/bin/ -nostdinc++ -B/export/gnu/import/git/gcc-test-profiled/bld/prev-x86_64-unknown-linux-gnu/libstdc++-v3/src/.libs -B/export/gnu/import/git/gcc-test-profiled/bld/prev-x86_64-unknown-linux-gnu/libstdc++-v3/libsupc++/.libs  -I/export/gnu/import/git/gcc-test-profiled/bld/prev-x86_64-unknown-linux-gnu/libstdc++-v3/include/x86_64-unknown-linux-gnu  -I/export/gnu/import/git/gcc-test-profiled/bld/prev-x86_64-unknown-linux-gnu/libstdc++-v3/include  -I/export/gnu/import/git/gcc-test-profiled/src-trunk/libstdc++-v3/libsupc++ -L/export/gnu/import/git/gcc-test-profiled/bld/prev-x86_64-unknown-linux-gnu/libstdc++-v3/src/.libs -L/export/gnu/import/git/gcc-test-profiled/bld/prev-x86_64-unknown-linux-gnu/libstdc++-v3/libsupc++/.libs -c   -g -O2 -flto=jobserver -frandom-seed=1 -fprofile-use -DIN_GCC    -fno-exceptions -fno-rtti -fasynchronous-unwind-tables -W -Wall -Wno-narrowing -Wwrite-strings -Wcast-qual -Wmissing-format-attribute -Woverloaded-virtual -pedantic -Wno-long-long -Wno-variadic-macros -Wno-overlength-strings -fno-common  -DHAVE_CONFIG_H -DGENERATOR_FILE -I. -Ibuild -I../../src-trunk/gcc -I../../src-trunk/gcc/build -I../../src-trunk/gcc/../include  -I../../src-trunk/gcc/../libcpp/include  \
	-o build/read-md.o ../../src-trunk/gcc/read-md.c
/export/gnu/import/git/gcc-test-profiled/bld/./prev-gcc/xg++ -B/export/gnu/import/git/gcc-test-profiled/bld/./prev-gcc/ -B/usr/5.0.0/x86_64-unknown-linux-gnu/bin/ -nostdinc++ -B/export/gnu/import/git/gcc-test-profiled/bld/prev-x86_64-unknown-linux-gnu/libstdc++-v3/src/.libs -B/export/gnu/import/git/gcc-test-profiled/bld/prev-x86_64-unknown-linux-gnu/libstdc++-v3/libsupc++/.libs  -I/export/gnu/import/git/gcc-test-profiled/bld/prev-x86_64-unknown-linux-gnu/libstdc++-v3/include/x86_64-unknown-linux-gnu  -I/export/gnu/import/git/gcc-test-profiled/bld/prev-x86_64-unknown-linux-gnu/libstdc++-v3/include  -I/export/gnu/import/git/gcc-test-profiled/src-trunk/libstdc++-v3/libsupc++ -L/export/gnu/import/git/gcc-test-profiled/bld/prev-x86_64-unknown-linux-gnu/libstdc++-v3/src/.libs -L/export/gnu/import/git/gcc-test-profiled/bld/prev-x86_64-unknown-linux-gnu/libstdc++-v3/libsupc++/.libs -c   -g -O2 -flto=jobserver -frandom-seed=1 -fprofile-use -DIN_GCC    -fno-exceptions -fno-rtti -fasynchronous-unwind-tables -W -Wall -Wno-narrowing -Wwrite-strings -Wcast-qual -Wmissing-format-attribute -Woverloaded-virtual -pedantic -Wno-long-long -Wno-variadic-macros -Wno-overlength-strings -fno-common  -DHAVE_CONFIG_H -DGENERATOR_FILE -I. -Ibuild -I../../src-trunk/gcc -I../../src-trunk/gcc/build -I../../src-trunk/gcc/../include  -I../../src-trunk/gcc/../libcpp/include  \
	-o build/errors.o ../../src-trunk/gcc/errors.c
/export/gnu/import/git/gcc-test-profiled/bld/./prev-gcc/xg++ -B/export/gnu/import/git/gcc-test-profiled/bld/./prev-gcc/ -B/usr/5.0.0/x86_64-unknown-linux-gnu/bin/ -nostdinc++ -B/export/gnu/import/git/gcc-test-profiled/bld/prev-x86_64-unknown-linux-gnu/libstdc++-v3/src/.libs -B/export/gnu/import/git/gcc-test-profiled/bld/prev-x86_64-unknown-linux-gnu/libstdc++-v3/libsupc++/.libs  -I/export/gnu/import/git/gcc-test-profiled/bld/prev-x86_64-unknown-linux-gnu/libstdc++-v3/include/x86_64-unknown-linux-gnu  -I/export/gnu/import/git/gcc-test-profiled/bld/prev-x86_64-unknown-linux-gnu/libstdc++-v3/include  -I/export/gnu/import/git/gcc-test-profiled/src-trunk/libstdc++-v3/libsupc++ -L/export/gnu/import/git/gcc-test-profiled/bld/prev-x86_64-unknown-linux-gnu/libstdc++-v3/src/.libs -L/export/gnu/import/git/gcc-test-profiled/bld/prev-x86_64-unknown-linux-gnu/libstdc++-v3/libsupc++/.libs -c   -g -O2 -flto=jobserver -frandom-seed=1 -fprofile-use -DIN_GCC    -fno-exceptions -fno-rtti -fasynchronous-unwind-tables -W -Wall -Wno-narrowing -Wwrite-strings -Wcast-qual -Wmissing-format-attribute -Woverloaded-virtual -pedantic -Wno-long-long -Wno-variadic-macros -Wno-overlength-strings -fno-common  -DHAVE_CONFIG_H -DGENERATOR_FILE -I. -Ibuild -I../../src-trunk/gcc -I../../src-trunk/gcc/build -I../../src-trunk/gcc/../include  -I../../src-trunk/gcc/../libcpp/include  \
	-o build/genmodes.o ../../src-trunk/gcc/genmodes.c
/export/gnu/import/git/gcc-test-profiled/bld/./prev-gcc/xg++ -B/export/gnu/import/git/gcc-test-profiled/bld/./prev-gcc/ -B/usr/5.0.0/x86_64-unknown-linux-gnu/bin/ -nostdinc++ -B/export/gnu/import/git/gcc-test-profiled/bld/prev-x86_64-unknown-linux-gnu/libstdc++-v3/src/.libs -B/export/gnu/import/git/gcc-test-profiled/bld/prev-x86_64-unknown-linux-gnu/libstdc++-v3/libsupc++/.libs  -I/export/gnu/import/git/gcc-test-profiled/bld/prev-x86_64-unknown-linux-gnu/libstdc++-v3/include/x86_64-unknown-linux-gnu  -I/export/gnu/import/git/gcc-test-profiled/bld/prev-x86_64-unknown-linux-gnu/libstdc++-v3/include  -I/export/gnu/import/git/gcc-test-profiled/src-trunk/libstdc++-v3/libsupc++ -L/export/gnu/import/git/gcc-test-profiled/bld/prev-x86_64-unknown-linux-gnu/libstdc++-v3/src/.libs -L/export/gnu/import/git/gcc-test-profiled/bld/prev-x86_64-unknown-linux-gnu/libstdc++-v3/libsupc++/.libs -c   -g -O2 -flto=jobserver -frandom-seed=1 -fprofile-use -DIN_GCC    -fno-exceptions -fno-rtti -fasynchronous-unwind-tables -W -Wall -Wno-narrowing -Wwrite-strings -Wcast-qual -Wmissing-format-attribute -Woverloaded-virtual -pedantic -Wno-long-long -Wno-variadic-macros -Wno-overlength-strings -fno-common  -DHAVE_CONFIG_H -DGENERATOR_FILE -I. -Ibuild -I../../src-trunk/gcc -I../../src-trunk/gcc/build -I../../src-trunk/gcc/../include  -I../../src-trunk/gcc/../libcpp/include  \
	-o build/gengtype.o ../../src-trunk/gcc/gengtype.c
/export/gnu/import/git/gcc-test-profiled/bld/./prev-gcc/xg++ -B/export/gnu/import/git/gcc-test-profiled/bld/./prev-gcc/ -B/usr/5.0.0/x86_64-unknown-linux-gnu/bin/ -nostdinc++ -B/export/gnu/import/git/gcc-test-profiled/bld/prev-x86_64-unknown-linux-gnu/libstdc++-v3/src/.libs -B/export/gnu/import/git/gcc-test-profiled/bld/prev-x86_64-unknown-linux-gnu/libstdc++-v3/libsupc++/.libs  -I/export/gnu/import/git/gcc-test-profiled/bld/prev-x86_64-unknown-linux-gnu/libstdc++-v3/include/x86_64-unknown-linux-gnu  -I/export/gnu/import/git/gcc-test-profiled/bld/prev-x86_64-unknown-linux-gnu/libstdc++-v3/include  -I/export/gnu/import/git/gcc-test-profiled/src-trunk/libstdc++-v3/libsupc++ -L/export/gnu/import/git/gcc-test-profiled/bld/prev-x86_64-unknown-linux-gnu/libstdc++-v3/src/.libs -L/export/gnu/import/git/gcc-test-profiled/bld/prev-x86_64-unknown-linux-gnu/libstdc++-v3/libsupc++/.libs -c   -g -O2 -flto=jobserver -frandom-seed=1 -fprofile-use -DIN_GCC    -fno-exceptions -fno-rtti -fasynchronous-unwind-tables -W -Wall -Wno-narrowing -Wwrite-strings -Wcast-qual -Wmissing-format-attribute -Woverloaded-virtual -pedantic -Wno-long-long -Wno-variadic-macros -Wno-overlength-strings -fno-common -Wno-error -DHAVE_CONFIG_H -DGENERATOR_FILE -I. -Ibuild -I../../src-trunk/gcc -I../../src-trunk/gcc/build -I../../src-trunk/gcc/../include  -I../../src-trunk/gcc/../libcpp/include  \
	-o build/gengtype-lex.o gengtype-lex.c
/export/gnu/import/git/gcc-test-profiled/bld/./prev-gcc/xg++ -B/export/gnu/import/git/gcc-test-profiled/bld/./prev-gcc/ -B/usr/5.0.0/x86_64-unknown-linux-gnu/bin/ -nostdinc++ -B/export/gnu/import/git/gcc-test-profiled/bld/prev-x86_64-unknown-linux-gnu/libstdc++-v3/src/.libs -B/export/gnu/import/git/gcc-test-profiled/bld/prev-x86_64-unknown-linux-gnu/libstdc++-v3/libsupc++/.libs  -I/export/gnu/import/git/gcc-test-profiled/bld/prev-x86_64-unknown-linux-gnu/libstdc++-v3/include/x86_64-unknown-linux-gnu  -I/export/gnu/import/git/gcc-test-profiled/bld/prev-x86_64-unknown-linux-gnu/libstdc++-v3/include  -I/export/gnu/import/git/gcc-test-profiled/src-trunk/libstdc++-v3/libsupc++ -L/export/gnu/import/git/gcc-test-profiled/bld/prev-x86_64-unknown-linux-gnu/libstdc++-v3/src/.libs -L/export/gnu/import/git/gcc-test-profiled/bld/prev-x86_64-unknown-linux-gnu/libstdc++-v3/libsupc++/.libs -c   -g -O2 -flto=jobserver -frandom-seed=1 -fprofile-use -DIN_GCC    -fno-exceptions -fno-rtti -fasynchronous-unwind-tables -W -Wall -Wno-narrowing -Wwrite-strings -Wcast-qual -Wmissing-format-attribute -Woverloaded-virtual -pedantic -Wno-long-long -Wno-variadic-macros -Wno-overlength-strings -fno-common  -DHAVE_CONFIG_H -DGENERATOR_FILE -I. -Ibuild -I../../src-trunk/gcc -I../../src-trunk/gcc/build -I../../src-trunk/gcc/../include  -I../../src-trunk/gcc/../libcpp/include  \
	-o build/gengtype-parse.o ../../src-trunk/gcc/gengtype-parse.c
/export/gnu/import/git/gcc-test-profiled/bld/./prev-gcc/xg++ -B/export/gnu/import/git/gcc-test-profiled/bld/./prev-gcc/ -B/usr/5.0.0/x86_64-unknown-linux-gnu/bin/ -nostdinc++ -B/export/gnu/import/git/gcc-test-profiled/bld/prev-x86_64-unknown-linux-gnu/libstdc++-v3/src/.libs -B/export/gnu/import/git/gcc-test-profiled/bld/prev-x86_64-unknown-linux-gnu/libstdc++-v3/libsupc++/.libs  -I/export/gnu/import/git/gcc-test-profiled/bld/prev-x86_64-unknown-linux-gnu/libstdc++-v3/include/x86_64-unknown-linux-gnu  -I/export/gnu/import/git/gcc-test-profiled/bld/prev-x86_64-unknown-linux-gnu/libstdc++-v3/include  -I/export/gnu/import/git/gcc-test-profiled/src-trunk/libstdc++-v3/libsupc++ -L/export/gnu/import/git/gcc-test-profiled/bld/prev-x86_64-unknown-linux-gnu/libstdc++-v3/src/.libs -L/export/gnu/import/git/gcc-test-profiled/bld/prev-x86_64-unknown-linux-gnu/libstdc++-v3/libsupc++/.libs -c   -g -O2 -flto=jobserver -frandom-seed=1 -fprofile-use -DIN_GCC    -fno-exceptions -fno-rtti -fasynchronous-unwind-tables -W -Wall -Wno-narrowing -Wwrite-strings -Wcast-qual -Wmissing-format-attribute -Woverloaded-virtual -pedantic -Wno-long-long -Wno-variadic-macros -Wno-overlength-strings -fno-common  -DHAVE_CONFIG_H -DGENERATOR_FILE -I. -Ibuild -I../../src-trunk/gcc -I../../src-trunk/gcc/build -I../../src-trunk/gcc/../include  -I../../src-trunk/gcc/../libcpp/include  \
	-o build/gengtype-state.o ../../src-trunk/gcc/gengtype-state.c
gawk -f ../../src-trunk/gcc/opt-functions.awk -f ../../src-trunk/gcc/opt-read.awk \
       -f ../../src-trunk/gcc/opth-gen.awk \
       < optionlist > tmp-options.h
/export/gnu/import/git/gcc-test-profiled/bld/./prev-gcc/xg++ -B/export/gnu/import/git/gcc-test-profiled/bld/./prev-gcc/ -B/usr/5.0.0/x86_64-unknown-linux-gnu/bin/ -nostdinc++ -B/export/gnu/import/git/gcc-test-profiled/bld/prev-x86_64-unknown-linux-gnu/libstdc++-v3/src/.libs -B/export/gnu/import/git/gcc-test-profiled/bld/prev-x86_64-unknown-linux-gnu/libstdc++-v3/libsupc++/.libs  -I/export/gnu/import/git/gcc-test-profiled/bld/prev-x86_64-unknown-linux-gnu/libstdc++-v3/include/x86_64-unknown-linux-gnu  -I/export/gnu/import/git/gcc-test-profiled/bld/prev-x86_64-unknown-linux-gnu/libstdc++-v3/include  -I/export/gnu/import/git/gcc-test-profiled/src-trunk/libstdc++-v3/libsupc++ -L/export/gnu/import/git/gcc-test-profiled/bld/prev-x86_64-unknown-linux-gnu/libstdc++-v3/src/.libs -L/export/gnu/import/git/gcc-test-profiled/bld/prev-x86_64-unknown-linux-gnu/libstdc++-v3/libsupc++/.libs   -g -O2 -flto=jobserver -frandom-seed=1 -fprofile-use -DIN_GCC    -fno-exceptions -fno-rtti -fasynchronous-unwind-tables -W -Wall -Wno-narrowing -Wwrite-strings -Wcast-qual -Wmissing-format-attribute -Woverloaded-virtual -pedantic -Wno-long-long -Wno-variadic-macros -Wno-overlength-strings -fno-common  -DHAVE_CONFIG_H -DGENERATOR_FILE -static-libstdc++ -static-libgcc  -o build/genconstants \
    build/genconstants.o build/read-md.o build/errors.o .././libiberty/libiberty.a
/export/gnu/import/git/gcc-test-profiled/bld/./prev-gcc/xg++ -B/export/gnu/import/git/gcc-test-profiled/bld/./prev-gcc/ -B/usr/5.0.0/x86_64-unknown-linux-gnu/bin/ -nostdinc++ -B/export/gnu/import/git/gcc-test-profiled/bld/prev-x86_64-unknown-linux-gnu/libstdc++-v3/src/.libs -B/export/gnu/import/git/gcc-test-profiled/bld/prev-x86_64-unknown-linux-gnu/libstdc++-v3/libsupc++/.libs  -I/export/gnu/import/git/gcc-test-profiled/bld/prev-x86_64-unknown-linux-gnu/libstdc++-v3/include/x86_64-unknown-linux-gnu  -I/export/gnu/import/git/gcc-test-profiled/bld/prev-x86_64-unknown-linux-gnu/libstdc++-v3/include  -I/export/gnu/import/git/gcc-test-profiled/src-trunk/libstdc++-v3/libsupc++ -L/export/gnu/import/git/gcc-test-profiled/bld/prev-x86_64-unknown-linux-gnu/libstdc++-v3/src/.libs -L/export/gnu/import/git/gcc-test-profiled/bld/prev-x86_64-unknown-linux-gnu/libstdc++-v3/libsupc++/.libs   -g -O2 -flto=jobserver -frandom-seed=1 -fprofile-use -DIN_GCC    -fno-exceptions -fno-rtti -fasynchronous-unwind-tables -W -Wall -Wno-narrowing -Wwrite-strings -Wcast-qual -Wmissing-format-attribute -Woverloaded-virtual -pedantic -Wno-long-long -Wno-variadic-macros -Wno-overlength-strings -fno-common  -DHAVE_CONFIG_H -DGENERATOR_FILE -static-libstdc++ -static-libgcc  -o build/gengenrtl \
    build/gengenrtl.o build/errors.o .././libiberty/libiberty.a
/bin/sh ../../src-trunk/gcc/../move-if-change tmp-options.h options.h
echo timestamp > s-options-h
/export/gnu/import/git/gcc-test-profiled/bld/./prev-gcc/xg++ -B/export/gnu/import/git/gcc-test-profiled/bld/./prev-gcc/ -B/usr/5.0.0/x86_64-unknown-linux-gnu/bin/ -nostdinc++ -B/export/gnu/import/git/gcc-test-profiled/bld/prev-x86_64-unknown-linux-gnu/libstdc++-v3/src/.libs -B/export/gnu/import/git/gcc-test-profiled/bld/prev-x86_64-unknown-linux-gnu/libstdc++-v3/libsupc++/.libs  -I/export/gnu/import/git/gcc-test-profiled/bld/prev-x86_64-unknown-linux-gnu/libstdc++-v3/include/x86_64-unknown-linux-gnu  -I/export/gnu/import/git/gcc-test-profiled/bld/prev-x86_64-unknown-linux-gnu/libstdc++-v3/include  -I/export/gnu/import/git/gcc-test-profiled/src-trunk/libstdc++-v3/libsupc++ -L/export/gnu/import/git/gcc-test-profiled/bld/prev-x86_64-unknown-linux-gnu/libstdc++-v3/src/.libs -L/export/gnu/import/git/gcc-test-profiled/bld/prev-x86_64-unknown-linux-gnu/libstdc++-v3/libsupc++/.libs   -g -O2 -flto=jobserver -frandom-seed=1 -fprofile-use -DIN_GCC    -fno-exceptions -fno-rtti -fasynchronous-unwind-tables -W -Wall -Wno-narrowing -Wwrite-strings -Wcast-qual -Wmissing-format-attribute -Woverloaded-virtual -pedantic -Wno-long-long -Wno-variadic-macros -Wno-overlength-strings -fno-common  -DHAVE_CONFIG_H -DGENERATOR_FILE -static-libstdc++ -static-libgcc  -o build/genhooks \
    build/genhooks.o build/errors.o .././libiberty/libiberty.a
/export/gnu/import/git/gcc-test-profiled/bld/./prev-gcc/xg++ -B/export/gnu/import/git/gcc-test-profiled/bld/./prev-gcc/ -B/usr/5.0.0/x86_64-unknown-linux-gnu/bin/ -nostdinc++ -B/export/gnu/import/git/gcc-test-profiled/bld/prev-x86_64-unknown-linux-gnu/libstdc++-v3/src/.libs -B/export/gnu/import/git/gcc-test-profiled/bld/prev-x86_64-unknown-linux-gnu/libstdc++-v3/libsupc++/.libs  -I/export/gnu/import/git/gcc-test-profiled/bld/prev-x86_64-unknown-linux-gnu/libstdc++-v3/include/x86_64-unknown-linux-gnu  -I/export/gnu/import/git/gcc-test-profiled/bld/prev-x86_64-unknown-linux-gnu/libstdc++-v3/include  -I/export/gnu/import/git/gcc-test-profiled/src-trunk/libstdc++-v3/libsupc++ -L/export/gnu/import/git/gcc-test-profiled/bld/prev-x86_64-unknown-linux-gnu/libstdc++-v3/src/.libs -L/export/gnu/import/git/gcc-test-profiled/bld/prev-x86_64-unknown-linux-gnu/libstdc++-v3/libsupc++/.libs   -g -O2 -flto=jobserver -frandom-seed=1 -fprofile-use -DIN_GCC    -fno-exceptions -fno-rtti -fasynchronous-unwind-tables -W -Wall -Wno-narrowing -Wwrite-strings -Wcast-qual -Wmissing-format-attribute -Woverloaded-virtual -pedantic -Wno-long-long -Wno-variadic-macros -Wno-overlength-strings -fno-common  -DHAVE_CONFIG_H -DGENERATOR_FILE -static-libstdc++ -static-libgcc  -o build/genchecksum \
    build/genchecksum.o .././libiberty/libiberty.a
/export/gnu/import/git/gcc-test-profiled/bld/./prev-gcc/xg++ -B/export/gnu/import/git/gcc-test-profiled/bld/./prev-gcc/ -B/usr/5.0.0/x86_64-unknown-linux-gnu/bin/ -nostdinc++ -B/export/gnu/import/git/gcc-test-profiled/bld/prev-x86_64-unknown-linux-gnu/libstdc++-v3/src/.libs -B/export/gnu/import/git/gcc-test-profiled/bld/prev-x86_64-unknown-linux-gnu/libstdc++-v3/libsupc++/.libs  -I/export/gnu/import/git/gcc-test-profiled/bld/prev-x86_64-unknown-linux-gnu/libstdc++-v3/include/x86_64-unknown-linux-gnu  -I/export/gnu/import/git/gcc-test-profiled/bld/prev-x86_64-unknown-linux-gnu/libstdc++-v3/include  -I/export/gnu/import/git/gcc-test-profiled/src-trunk/libstdc++-v3/libsupc++ -L/export/gnu/import/git/gcc-test-profiled/bld/prev-x86_64-unknown-linux-gnu/libstdc++-v3/src/.libs -L/export/gnu/import/git/gcc-test-profiled/bld/prev-x86_64-unknown-linux-gnu/libstdc++-v3/libsupc++/.libs   -g -O2 -flto=jobserver -frandom-seed=1 -fprofile-use -DIN_GCC    -fno-exceptions -fno-rtti -fasynchronous-unwind-tables -W -Wall -Wno-narrowing -Wwrite-strings -Wcast-qual -Wmissing-format-attribute -Woverloaded-virtual -pedantic -Wno-long-long -Wno-variadic-macros -Wno-overlength-strings -fno-common  -DHAVE_CONFIG_H -DGENERATOR_FILE -static-libstdc++ -static-libgcc  -o build/genenums \
    build/genenums.o build/read-md.o build/errors.o .././libiberty/libiberty.a
echo timestamp > doc/gcc.1
(pod2man --center="GNU" --release="gcc-5.0.0" --date=2014-11-24 --section=1 gcc.pod > doc/gcc.1.T$$ && \
	mv -f doc/gcc.1.T$$ doc/gcc.1) || \
	(rm -f doc/gcc.1.T$$ && exit 1)
/export/gnu/import/git/gcc-test-profiled/bld/./prev-gcc/xg++ -B/export/gnu/import/git/gcc-test-profiled/bld/./prev-gcc/ -B/usr/5.0.0/x86_64-unknown-linux-gnu/bin/ -nostdinc++ -B/export/gnu/import/git/gcc-test-profiled/bld/prev-x86_64-unknown-linux-gnu/libstdc++-v3/src/.libs -B/export/gnu/import/git/gcc-test-profiled/bld/prev-x86_64-unknown-linux-gnu/libstdc++-v3/libsupc++/.libs  -I/export/gnu/import/git/gcc-test-profiled/bld/prev-x86_64-unknown-linux-gnu/libstdc++-v3/include/x86_64-unknown-linux-gnu  -I/export/gnu/import/git/gcc-test-profiled/bld/prev-x86_64-unknown-linux-gnu/libstdc++-v3/include  -I/export/gnu/import/git/gcc-test-profiled/src-trunk/libstdc++-v3/libsupc++ -L/export/gnu/import/git/gcc-test-profiled/bld/prev-x86_64-unknown-linux-gnu/libstdc++-v3/src/.libs -L/export/gnu/import/git/gcc-test-profiled/bld/prev-x86_64-unknown-linux-gnu/libstdc++-v3/libsupc++/.libs   -g -O2 -flto=jobserver -frandom-seed=1 -fprofile-use -DIN_GCC    -fno-exceptions -fno-rtti -fasynchronous-unwind-tables -W -Wall -Wno-narrowing -Wwrite-strings -Wcast-qual -Wmissing-format-attribute -Woverloaded-virtual -pedantic -Wno-long-long -Wno-variadic-macros -Wno-overlength-strings -fno-common  -DHAVE_CONFIG_H -DGENERATOR_FILE -static-libstdc++ -static-libgcc  -o build/genmddeps \
    build/genmddeps.o build/read-md.o build/errors.o .././libiberty/libiberty.a
/export/gnu/import/git/gcc-test-profiled/bld/./prev-gcc/xg++ -B/export/gnu/import/git/gcc-test-profiled/bld/./prev-gcc/ -B/usr/5.0.0/x86_64-unknown-linux-gnu/bin/ -nostdinc++ -B/export/gnu/import/git/gcc-test-profiled/bld/prev-x86_64-unknown-linux-gnu/libstdc++-v3/src/.libs -B/export/gnu/import/git/gcc-test-profiled/bld/prev-x86_64-unknown-linux-gnu/libstdc++-v3/libsupc++/.libs  -I/export/gnu/import/git/gcc-test-profiled/bld/prev-x86_64-unknown-linux-gnu/libstdc++-v3/include/x86_64-unknown-linux-gnu  -I/export/gnu/import/git/gcc-test-profiled/bld/prev-x86_64-unknown-linux-gnu/libstdc++-v3/include  -I/export/gnu/import/git/gcc-test-profiled/src-trunk/libstdc++-v3/libsupc++ -L/export/gnu/import/git/gcc-test-profiled/bld/prev-x86_64-unknown-linux-gnu/libstdc++-v3/src/.libs -L/export/gnu/import/git/gcc-test-profiled/bld/prev-x86_64-unknown-linux-gnu/libstdc++-v3/libsupc++/.libs   -g -O2 -flto=jobserver -frandom-seed=1 -fprofile-use -DIN_GCC    -fno-exceptions -fno-rtti -fasynchronous-unwind-tables -W -Wall -Wno-narrowing -Wwrite-strings -Wcast-qual -Wmissing-format-attribute -Woverloaded-virtual -pedantic -Wno-long-long -Wno-variadic-macros -Wno-overlength-strings -fno-common  -DHAVE_CONFIG_H -DGENERATOR_FILE -static-libstdc++ -static-libgcc  -o build/genmodes \
    build/genmodes.o build/errors.o .././libiberty/libiberty.a
/export/gnu/import/git/gcc-test-profiled/bld/./prev-gcc/xg++ -B/export/gnu/import/git/gcc-test-profiled/bld/./prev-gcc/ -B/usr/5.0.0/x86_64-unknown-linux-gnu/bin/ -nostdinc++ -B/export/gnu/import/git/gcc-test-profiled/bld/prev-x86_64-unknown-linux-gnu/libstdc++-v3/src/.libs -B/export/gnu/import/git/gcc-test-profiled/bld/prev-x86_64-unknown-linux-gnu/libstdc++-v3/libsupc++/.libs  -I/export/gnu/import/git/gcc-test-profiled/bld/prev-x86_64-unknown-linux-gnu/libstdc++-v3/include/x86_64-unknown-linux-gnu  -I/export/gnu/import/git/gcc-test-profiled/bld/prev-x86_64-unknown-linux-gnu/libstdc++-v3/include  -I/export/gnu/import/git/gcc-test-profiled/src-trunk/libstdc++-v3/libsupc++ -L/export/gnu/import/git/gcc-test-profiled/bld/prev-x86_64-unknown-linux-gnu/libstdc++-v3/src/.libs -L/export/gnu/import/git/gcc-test-profiled/bld/prev-x86_64-unknown-linux-gnu/libstdc++-v3/libsupc++/.libs   -g -O2 -flto=jobserver -frandom-seed=1 -fprofile-use -DIN_GCC    -fno-exceptions -fno-rtti -fasynchronous-unwind-tables -W -Wall -Wno-narrowing -Wwrite-strings -Wcast-qual -Wmissing-format-attribute -Woverloaded-virtual -pedantic -Wno-long-long -Wno-variadic-macros -Wno-overlength-strings -fno-common  -DHAVE_CONFIG_H -DGENERATOR_FILE -static-libstdc++ -static-libgcc  -o build/gengtype \
    build/gengtype.o build/errors.o build/gengtype-lex.o build/gengtype-parse.o build/gengtype-state.o build/version.o .././libiberty/libiberty.a
lto1: internal compiler error: in inline_small_functions, at ipa-inline.c:1709
0x190d403 inline_small_functions
	../../src-trunk/gcc/ipa-inline.c:1709
0x190d403 ipa_inline
	../../src-trunk/gcc/ipa-inline.c:2189
0x190d403 execute
	../../src-trunk/gcc/ipa-inline.c:2558
Please submit a full bug report,
with preprocessed source if appropriate.
Please include the complete backtrace with any bug report.
See <http://gcc.gnu.org/bugs.html> for instructions.
lto-wrapper: fatal error: /export/gnu/import/git/gcc-test-profiled/bld/./prev-gcc/xg++ returned 1 exit status
compilation terminated.
/usr/local/bin/ld: lto-wrapper failed
collect2: error: ld returned 1 exit status
make[6]: *** [build/gengtype] Error 1
make[6]: *** Waiting for unfinished jobs....
rm gcj-dbtool.pod gcj.pod gij.pod jcf-dump.pod gcov-tool.pod grmic.pod gcov.pod cpp.pod gfdl.pod fsf-funding.pod gc-analyze.pod jv-convert.pod gfortran.pod gcc.pod
make[6]: Leaving directory `/export/gnu/import/git/gcc-test-profiled/bld/gcc'
make[5]: *** [all-stagefeedback-gcc] Error 2
make[5]: Leaving directory `/export/gnu/import/git/gcc-test-profiled/bld'
make[4]: *** [stagefeedback-bubble] Error 2
make[4]: Leaving directory `/export/gnu/import/git/gcc-test-profiled/bld'
make[3]: *** [profiledbootstrap] Error 2
make[3]: Leaving directory `/export/gnu/import/git/gcc-test-profiled/bld'
17398.54user 339.37system 1:00:13elapsed 490%CPU (0avgtext+0avgdata 796432maxresident)k
695944inputs+16146400outputs (10114major+91312893minor)pagefaults 0swaps
make[2]: *** [profiledbootstrap] Error 2
make[2]: Leaving directory `/export/gnu/import/git/gcc-test-profiled'



More information about the Gcc-regression mailing list