Gcc [trunk revision 217374] failed to profiledbootstrap on x86_64!

H.J. Lu Intel64 LTO/FDO intel64profiled@gnu-mic-1.sc.intel.com
Tue Nov 11 23:58:00 GMT 2014


cd bld; \
 RUNTESTFLAGS="--target_board='unix{-m32,}'" ../src-trunk/configure \
	 --prefix=/usr/5.0.0 --enable-clocale=gnu --with-system-zlib --enable-shared --with-demangler-in-ld --with-build-config=bootstrap-lto --disable-werror --with-fpmath=sse --enable-languages=c,c++,fortran,java,lto,objc
checking build system type... x86_64-unknown-linux-gnu
checking host system type... x86_64-unknown-linux-gnu
checking target system type... x86_64-unknown-linux-gnu
checking for a BSD-compatible install... /bin/install -c
    grep "Error " makelog.217374.trunk.x86_64 >> makelog.217374.trunk.x86_64.mail; \
make[7]: *** [/tmp/ccGmyyTO.ltrans11.ltrans.o] Error 1
make[6]: *** [build/genmatch] Error 1
make[5]: *** [all-stagefeedback-gcc] Error 2
make[4]: *** [stagefeedback-bubble] Error 2
make[3]: *** [profiledbootstrap] Error 2
make[2]: *** [profiledbootstrap] Error 2
/export/gnu/import/git/gcc-test-profiled/bld/./prev-gcc/xg++ -B/export/gnu/import/git/gcc-test-profiled/bld/./prev-gcc/ -B/usr/5.0.0/x86_64-unknown-linux-gnu/bin/ -nostdinc++ -B/export/gnu/import/git/gcc-test-profiled/bld/prev-x86_64-unknown-linux-gnu/libstdc++-v3/src/.libs -B/export/gnu/import/git/gcc-test-profiled/bld/prev-x86_64-unknown-linux-gnu/libstdc++-v3/libsupc++/.libs  -I/export/gnu/import/git/gcc-test-profiled/bld/prev-x86_64-unknown-linux-gnu/libstdc++-v3/include/x86_64-unknown-linux-gnu  -I/export/gnu/import/git/gcc-test-profiled/bld/prev-x86_64-unknown-linux-gnu/libstdc++-v3/include  -I/export/gnu/import/git/gcc-test-profiled/src-trunk/libstdc++-v3/libsupc++ -L/export/gnu/import/git/gcc-test-profiled/bld/prev-x86_64-unknown-linux-gnu/libstdc++-v3/src/.libs -L/export/gnu/import/git/gcc-test-profiled/bld/prev-x86_64-unknown-linux-gnu/libstdc++-v3/libsupc++/.libs   -g -O2 -flto=jobserver -frandom-seed=1 -fprofile-use -DIN_GCC    -fno-exceptions -fno-rtti -fasynchronous-unwind-tables -W -Wall -Wno-narrowing -Wwrite-strings -Wcast-qual -Wmissing-format-attribute -Woverloaded-virtual -pedantic -Wno-long-long -Wno-variadic-macros -Wno-overlength-strings -fno-common  -DHAVE_CONFIG_H -DGENERATOR_FILE -static-libstdc++ -static-libgcc  -o build/genextract \
    build/genextract.o build/rtl.o build/read-rtl.o build/ggc-none.o build/vec.o build/min-insn-modes.o build/gensupport.o build/print-rtl.o build/read-md.o build/errors.o .././libiberty/libiberty.a
/export/gnu/import/git/gcc-test-profiled/bld/./prev-gcc/xg++ -B/export/gnu/import/git/gcc-test-profiled/bld/./prev-gcc/ -B/usr/5.0.0/x86_64-unknown-linux-gnu/bin/ -nostdinc++ -B/export/gnu/import/git/gcc-test-profiled/bld/prev-x86_64-unknown-linux-gnu/libstdc++-v3/src/.libs -B/export/gnu/import/git/gcc-test-profiled/bld/prev-x86_64-unknown-linux-gnu/libstdc++-v3/libsupc++/.libs  -I/export/gnu/import/git/gcc-test-profiled/bld/prev-x86_64-unknown-linux-gnu/libstdc++-v3/include/x86_64-unknown-linux-gnu  -I/export/gnu/import/git/gcc-test-profiled/bld/prev-x86_64-unknown-linux-gnu/libstdc++-v3/include  -I/export/gnu/import/git/gcc-test-profiled/src-trunk/libstdc++-v3/libsupc++ -L/export/gnu/import/git/gcc-test-profiled/bld/prev-x86_64-unknown-linux-gnu/libstdc++-v3/src/.libs -L/export/gnu/import/git/gcc-test-profiled/bld/prev-x86_64-unknown-linux-gnu/libstdc++-v3/libsupc++/.libs   -g -O2 -flto=jobserver -frandom-seed=1 -fprofile-use -DIN_GCC    -fno-exceptions -fno-rtti -fasynchronous-unwind-tables -W -Wall -Wno-narrowing -Wwrite-strings -Wcast-qual -Wmissing-format-attribute -Woverloaded-virtual -pedantic -Wno-long-long -Wno-variadic-macros -Wno-overlength-strings -fno-common  -DHAVE_CONFIG_H -DGENERATOR_FILE -static-libstdc++ -static-libgcc  -o build/genoutput \
    build/genoutput.o build/rtl.o build/read-rtl.o build/ggc-none.o build/vec.o build/min-insn-modes.o build/gensupport.o build/print-rtl.o build/read-md.o build/errors.o .././libiberty/libiberty.a
/export/gnu/import/git/gcc-test-profiled/bld/./prev-gcc/xg++ -B/export/gnu/import/git/gcc-test-profiled/bld/./prev-gcc/ -B/usr/5.0.0/x86_64-unknown-linux-gnu/bin/ -nostdinc++ -B/export/gnu/import/git/gcc-test-profiled/bld/prev-x86_64-unknown-linux-gnu/libstdc++-v3/src/.libs -B/export/gnu/import/git/gcc-test-profiled/bld/prev-x86_64-unknown-linux-gnu/libstdc++-v3/libsupc++/.libs  -I/export/gnu/import/git/gcc-test-profiled/bld/prev-x86_64-unknown-linux-gnu/libstdc++-v3/include/x86_64-unknown-linux-gnu  -I/export/gnu/import/git/gcc-test-profiled/bld/prev-x86_64-unknown-linux-gnu/libstdc++-v3/include  -I/export/gnu/import/git/gcc-test-profiled/src-trunk/libstdc++-v3/libsupc++ -L/export/gnu/import/git/gcc-test-profiled/bld/prev-x86_64-unknown-linux-gnu/libstdc++-v3/src/.libs -L/export/gnu/import/git/gcc-test-profiled/bld/prev-x86_64-unknown-linux-gnu/libstdc++-v3/libsupc++/.libs   -g -O2 -flto=jobserver -frandom-seed=1 -fprofile-use -DIN_GCC    -fno-exceptions -fno-rtti -fasynchronous-unwind-tables -W -Wall -Wno-narrowing -Wwrite-strings -Wcast-qual -Wmissing-format-attribute -Woverloaded-virtual -pedantic -Wno-long-long -Wno-variadic-macros -Wno-overlength-strings -fno-common  -DHAVE_CONFIG_H -DGENERATOR_FILE -static-libstdc++ -static-libgcc  -o build/genpeep \
    build/genpeep.o build/rtl.o build/read-rtl.o build/ggc-none.o build/vec.o build/min-insn-modes.o build/gensupport.o build/print-rtl.o build/read-md.o build/errors.o .././libiberty/libiberty.a
build/genpreds ../../src-trunk/gcc/common.md ../../src-trunk/gcc/config/i386/i386.md > tmp-preds.c
/bin/sh ../../src-trunk/gcc/../move-if-change tmp-preds.c insn-preds.c
echo timestamp > s-preds
/export/gnu/import/git/gcc-test-profiled/bld/./prev-gcc/xg++ -B/export/gnu/import/git/gcc-test-profiled/bld/./prev-gcc/ -B/usr/5.0.0/x86_64-unknown-linux-gnu/bin/ -nostdinc++ -B/export/gnu/import/git/gcc-test-profiled/bld/prev-x86_64-unknown-linux-gnu/libstdc++-v3/src/.libs -B/export/gnu/import/git/gcc-test-profiled/bld/prev-x86_64-unknown-linux-gnu/libstdc++-v3/libsupc++/.libs  -I/export/gnu/import/git/gcc-test-profiled/bld/prev-x86_64-unknown-linux-gnu/libstdc++-v3/include/x86_64-unknown-linux-gnu  -I/export/gnu/import/git/gcc-test-profiled/bld/prev-x86_64-unknown-linux-gnu/libstdc++-v3/include  -I/export/gnu/import/git/gcc-test-profiled/src-trunk/libstdc++-v3/libsupc++ -L/export/gnu/import/git/gcc-test-profiled/bld/prev-x86_64-unknown-linux-gnu/libstdc++-v3/src/.libs -L/export/gnu/import/git/gcc-test-profiled/bld/prev-x86_64-unknown-linux-gnu/libstdc++-v3/libsupc++/.libs   -g -O2 -flto=jobserver -frandom-seed=1 -fprofile-use -DIN_GCC    -fno-exceptions -fno-rtti -fasynchronous-unwind-tables -W -Wall -Wno-narrowing -Wwrite-strings -Wcast-qual -Wmissing-format-attribute -Woverloaded-virtual -pedantic -Wno-long-long -Wno-variadic-macros -Wno-overlength-strings -fno-common  -DHAVE_CONFIG_H -DGENERATOR_FILE -static-libstdc++ -static-libgcc  -o build/genrecog \
    build/genrecog.o build/rtl.o build/read-rtl.o build/ggc-none.o build/vec.o build/min-insn-modes.o build/gensupport.o build/print-rtl.o build/read-md.o build/errors.o .././libiberty/libiberty.a
/export/gnu/import/git/gcc-test-profiled/bld/./prev-gcc/xg++ -B/export/gnu/import/git/gcc-test-profiled/bld/./prev-gcc/ -B/usr/5.0.0/x86_64-unknown-linux-gnu/bin/ -nostdinc++ -B/export/gnu/import/git/gcc-test-profiled/bld/prev-x86_64-unknown-linux-gnu/libstdc++-v3/src/.libs -B/export/gnu/import/git/gcc-test-profiled/bld/prev-x86_64-unknown-linux-gnu/libstdc++-v3/libsupc++/.libs  -I/export/gnu/import/git/gcc-test-profiled/bld/prev-x86_64-unknown-linux-gnu/libstdc++-v3/include/x86_64-unknown-linux-gnu  -I/export/gnu/import/git/gcc-test-profiled/bld/prev-x86_64-unknown-linux-gnu/libstdc++-v3/include  -I/export/gnu/import/git/gcc-test-profiled/src-trunk/libstdc++-v3/libsupc++ -L/export/gnu/import/git/gcc-test-profiled/bld/prev-x86_64-unknown-linux-gnu/libstdc++-v3/src/.libs -L/export/gnu/import/git/gcc-test-profiled/bld/prev-x86_64-unknown-linux-gnu/libstdc++-v3/libsupc++/.libs   -g -O2 -flto=jobserver -frandom-seed=1 -fprofile-use -DIN_GCC    -fno-exceptions -fno-rtti -fasynchronous-unwind-tables -W -Wall -Wno-narrowing -Wwrite-strings -Wcast-qual -Wmissing-format-attribute -Woverloaded-virtual -pedantic -Wno-long-long -Wno-variadic-macros -Wno-overlength-strings -fno-common  -DHAVE_CONFIG_H -DGENERATOR_FILE -static-libstdc++ -static-libgcc  -o build/genmatch \
    build/genmatch.o ../libcpp/libcpp.a ../libiberty/libiberty.a build/errors.o build/vec.o build/hash-table.o .././libiberty/libiberty.a  
build/genpreds -h ../../src-trunk/gcc/common.md ../../src-trunk/gcc/config/i386/i386.md > tmp-preds.h
build/genconditions ../../src-trunk/gcc/common.md ../../src-trunk/gcc/config/i386/i386.md > tmp-condmd.c
/bin/sh ../../src-trunk/gcc/../move-if-change tmp-preds.h tm-preds.h
echo timestamp > s-preds-h
build/genpreds -c ../../src-trunk/gcc/common.md ../../src-trunk/gcc/config/i386/i386.md > tmp-constrs.h
/bin/sh ../../src-trunk/gcc/../move-if-change tmp-condmd.c build/gencondmd.c
echo timestamp > s-conditions
/bin/sh ../../src-trunk/gcc/../move-if-change tmp-constrs.h tm-constrs.h
echo timestamp > s-constrs-h
/export/gnu/import/git/gcc-test-profiled/bld/./prev-gcc/xg++ -B/export/gnu/import/git/gcc-test-profiled/bld/./prev-gcc/ -B/usr/5.0.0/x86_64-unknown-linux-gnu/bin/ -nostdinc++ -B/export/gnu/import/git/gcc-test-profiled/bld/prev-x86_64-unknown-linux-gnu/libstdc++-v3/src/.libs -B/export/gnu/import/git/gcc-test-profiled/bld/prev-x86_64-unknown-linux-gnu/libstdc++-v3/libsupc++/.libs  -I/export/gnu/import/git/gcc-test-profiled/bld/prev-x86_64-unknown-linux-gnu/libstdc++-v3/include/x86_64-unknown-linux-gnu  -I/export/gnu/import/git/gcc-test-profiled/bld/prev-x86_64-unknown-linux-gnu/libstdc++-v3/include  -I/export/gnu/import/git/gcc-test-profiled/src-trunk/libstdc++-v3/libsupc++ -L/export/gnu/import/git/gcc-test-profiled/bld/prev-x86_64-unknown-linux-gnu/libstdc++-v3/src/.libs -L/export/gnu/import/git/gcc-test-profiled/bld/prev-x86_64-unknown-linux-gnu/libstdc++-v3/libsupc++/.libs -c   -g -O2 -flto=jobserver -frandom-seed=1 -fprofile-use -DIN_GCC    -fno-exceptions -fno-rtti -fasynchronous-unwind-tables -W -Wall -Wno-narrowing -Wwrite-strings -Wcast-qual -Wmissing-format-attribute -Woverloaded-virtual -pedantic -Wno-long-long -Wno-variadic-macros -Wno-overlength-strings -fno-common  -DHAVE_CONFIG_H -DGENERATOR_FILE -I. -Ibuild -I../../src-trunk/gcc -I../../src-trunk/gcc/build -I../../src-trunk/gcc/../include  -I../../src-trunk/gcc/../libcpp/include  \
	-o build/gencondmd.o build/gencondmd.c
/export/gnu/import/git/gcc-test-profiled/bld/./prev-gcc/xg++ -B/export/gnu/import/git/gcc-test-profiled/bld/./prev-gcc/ -B/usr/5.0.0/x86_64-unknown-linux-gnu/bin/ -nostdinc++ -B/export/gnu/import/git/gcc-test-profiled/bld/prev-x86_64-unknown-linux-gnu/libstdc++-v3/src/.libs -B/export/gnu/import/git/gcc-test-profiled/bld/prev-x86_64-unknown-linux-gnu/libstdc++-v3/libsupc++/.libs  -I/export/gnu/import/git/gcc-test-profiled/bld/prev-x86_64-unknown-linux-gnu/libstdc++-v3/include/x86_64-unknown-linux-gnu  -I/export/gnu/import/git/gcc-test-profiled/bld/prev-x86_64-unknown-linux-gnu/libstdc++-v3/include  -I/export/gnu/import/git/gcc-test-profiled/src-trunk/libstdc++-v3/libsupc++ -L/export/gnu/import/git/gcc-test-profiled/bld/prev-x86_64-unknown-linux-gnu/libstdc++-v3/src/.libs -L/export/gnu/import/git/gcc-test-profiled/bld/prev-x86_64-unknown-linux-gnu/libstdc++-v3/libsupc++/.libs   -g -O2 -flto=jobserver -frandom-seed=1 -fprofile-use -DIN_GCC    -fno-exceptions -fno-rtti -fasynchronous-unwind-tables -W -Wall -Wno-narrowing -Wwrite-strings -Wcast-qual -Wmissing-format-attribute -Woverloaded-virtual -pedantic -Wno-long-long -Wno-variadic-macros -Wno-overlength-strings -fno-common  -DHAVE_CONFIG_H -DGENERATOR_FILE -static-libstdc++ -static-libgcc  -o build/gencondmd \
    build/gencondmd.o .././libiberty/libiberty.a
build/gencondmd > tmp-cond.md
/bin/sh ../../src-trunk/gcc/../move-if-change tmp-cond.md insn-conditions.md
echo timestamp > s-condmd
build/genflags ../../src-trunk/gcc/common.md ../../src-trunk/gcc/config/i386/i386.md \
  insn-conditions.md > tmp-flags.h
build/genattr ../../src-trunk/gcc/common.md ../../src-trunk/gcc/config/i386/i386.md \
  insn-conditions.md > tmp-attr.h
build/genattr-common ../../src-trunk/gcc/common.md ../../src-trunk/gcc/config/i386/i386.md \
  insn-conditions.md > tmp-attr-common.h
build/gencodes ../../src-trunk/gcc/common.md ../../src-trunk/gcc/config/i386/i386.md \
  insn-conditions.md > tmp-codes.h
build/genconfig ../../src-trunk/gcc/common.md ../../src-trunk/gcc/config/i386/i386.md \
  insn-conditions.md > tmp-config.h
build/genopinit ../../src-trunk/gcc/common.md ../../src-trunk/gcc/config/i386/i386.md \
  insn-conditions.md -htmp-opinit.h -ctmp-opinit.c
build/genattrtab ../../src-trunk/gcc/common.md ../../src-trunk/gcc/config/i386/i386.md insn-conditions.md \
	-Atmp-attrtab.c -Dtmp-dfatab.c -Ltmp-latencytab.c
../../src-trunk/gcc/genmatch.c: In function ‘get_operator’:
../../src-trunk/gcc/genmatch.c:329:1: internal compiler error: in get_string_length, at tree-ssa-strlen.c:428
 get_operator (const char *id)
 ^
0x112c6aa get_string_length
	../../src-trunk/gcc/tree-ssa-strlen.c:428
0x112d828 handle_builtin_strlen
	../../src-trunk/gcc/tree-ssa-strlen.c:910
0x1131a04 strlen_optimize_stmt
	../../src-trunk/gcc/tree-ssa-strlen.c:1904
0x1131a04 strlen_dom_walker::before_dom_children(basic_block_def*)
	../../src-trunk/gcc/tree-ssa-strlen.c:2109
0x180898c dom_walker::walk(basic_block_def*)
	../../src-trunk/gcc/domwalk.c:188
0x112a552 execute
	../../src-trunk/gcc/tree-ssa-strlen.c:2182
Please submit a full bug report,
with preprocessed source if appropriate.
Please include the complete backtrace with any bug report.
See <http://gcc.gnu.org/bugs.html> for instructions.
make[7]: *** [/tmp/ccGmyyTO.ltrans11.ltrans.o] Error 1
make[7]: *** Waiting for unfinished jobs....
lto-wrapper: fatal error: make returned 2 exit status
compilation terminated.
/usr/local/bin/ld: lto-wrapper failed
collect2: error: ld returned 1 exit status
make[6]: *** [build/genmatch] Error 1
make[6]: *** Waiting for unfinished jobs....
/bin/sh ../../src-trunk/gcc/../move-if-change tmp-codes.h insn-codes.h
/bin/sh ../../src-trunk/gcc/../move-if-change tmp-opinit.h insn-opinit.h
echo timestamp > s-codes
/bin/sh ../../src-trunk/gcc/../move-if-change tmp-attr.h insn-attr.h
/bin/sh ../../src-trunk/gcc/../move-if-change tmp-flags.h insn-flags.h
echo timestamp > s-attr
echo timestamp > s-flags
/bin/sh ../../src-trunk/gcc/../move-if-change tmp-opinit.c insn-opinit.c
echo timestamp > s-opinit
/bin/sh ../../src-trunk/gcc/../move-if-change tmp-config.h insn-config.h
/bin/sh ../../src-trunk/gcc/../move-if-change tmp-attr-common.h insn-attr-common.h
echo timestamp > s-config
echo timestamp > s-attr-common
/bin/sh ../../src-trunk/gcc/../move-if-change tmp-attrtab.c    insn-attrtab.c
/bin/sh ../../src-trunk/gcc/../move-if-change tmp-dfatab.c     insn-dfatab.c
/bin/sh ../../src-trunk/gcc/../move-if-change tmp-latencytab.c insn-latencytab.c
echo timestamp > s-attrtab
rm gcj-dbtool.pod gcov-tool.pod jcf-dump.pod jv-convert.pod grmic.pod gcov.pod gcj.pod cpp.pod gfdl.pod gij.pod gc-analyze.pod gfortran.pod fsf-funding.pod gcc.pod
make[6]: Leaving directory `/export/gnu/import/git/gcc-test-profiled/bld/gcc'
make[5]: *** [all-stagefeedback-gcc] Error 2
make[5]: Leaving directory `/export/gnu/import/git/gcc-test-profiled/bld'
make[4]: *** [stagefeedback-bubble] Error 2
make[4]: Leaving directory `/export/gnu/import/git/gcc-test-profiled/bld'
make[3]: *** [profiledbootstrap] Error 2
make[3]: Leaving directory `/export/gnu/import/git/gcc-test-profiled/bld'
17331.81user 353.66system 1:02:53elapsed 468%CPU (0avgtext+0avgdata 792884maxresident)k
560872inputs+16050968outputs (9880major+93491221minor)pagefaults 0swaps
make[2]: *** [profiledbootstrap] Error 2
make[2]: Leaving directory `/export/gnu/import/git/gcc-test-profiled'



More information about the Gcc-regression mailing list