Gcc [trunk revision 211598] failed to bootstrap on x86_64!

Denis Larionov [Intel64 Core AVX2] i64corei7avx2@ecsmtp.ims.intel.com
Thu Jun 12 22:49:00 GMT 2014


rm -rf bld
mkdir -p bld
cd bld; \
 RUNTESTFLAGS="--target_board='unix{-m32,}'" ../src-trunk/configure \
	--with-arch=core-avx2 --with-cpu=core-avx2 --prefix=/usr/local --enable-clocale=gnu --with-system-zlib --enable-shared --with-demangler-in-ld --enable-cloog-backend=isl --with-ppl-include=/opt/gnu/include --with-ppl-lib=/opt/gnu/lib64 --with-cloog-include=/opt/gnu/include --with-cloog-lib=/opt/gnu/lib64 --with-fpmath=sse --enable-languages=c,c++,fortran,java,lto,objc
checking build system type... x86_64-unknown-linux-gnu
checking host system type... x86_64-unknown-linux-gnu
    grep "Error " makelog.211598.trunk.x86_64.core-avx2 >> makelog.211598.trunk.x86_64.core-avx2.mail; \
make[13]: *** [hash_tr1.lo] Error 1
make[13]: *** [hash_c++0x.lo] Error 1
make[12]: *** [all-recursive] Error 1
make[11]: *** [all-recursive] Error 1
make[10]: *** [all] Error 2
make[9]: *** [multi-do] Error 1
make[8]: *** [all-multi] Error 2
make[7]: *** [all-recursive] Error 1
make[6]: *** [all] Error 2
make[5]: *** [all-stage1-target-libstdc++-v3] Error 2
make[4]: *** [stage1-bubble] Error 2
make[3]: *** [bootstrap] Error 2
make[2]: *** [bootstrap] Error 2
/bin/sh ../../libtool --tag CXX --tag disable-shared   --mode=compile /export/users/nightly/gcc.svn/test-intel64corei7avx2/gcc-build-trunk/bld/./gcc/xgcc -shared-libgcc -B/export/users/nightly/gcc.svn/test-intel64corei7avx2/gcc-build-trunk/bld/./gcc -nostdinc++ -L/export/users/nightly/gcc.svn/test-intel64corei7avx2/gcc-build-trunk/bld/x86_64-unknown-linux-gnu/32/libstdc++-v3/src -L/export/users/nightly/gcc.svn/test-intel64corei7avx2/gcc-build-trunk/bld/x86_64-unknown-linux-gnu/32/libstdc++-v3/src/.libs -L/export/users/nightly/gcc.svn/test-intel64corei7avx2/gcc-build-trunk/bld/x86_64-unknown-linux-gnu/32/libstdc++-v3/libsupc++/.libs -B/usr/local/x86_64-unknown-linux-gnu/bin/ -B/usr/local/x86_64-unknown-linux-gnu/lib/ -isystem /usr/local/x86_64-unknown-linux-gnu/include -isystem /usr/local/x86_64-unknown-linux-gnu/sys-include  -m32 -I/export/users/nightly/gcc.svn/test-intel64corei7avx2/gcc-build-trunk/src-trunk/libstdc++-v3/../libgcc -I/export/users/nightly/gcc.svn/test-intel64corei7avx2/gcc-build-trunk/bld/x86_64-unknown-linux-gnu/32/libstdc++-v3/include/x86_64-unknown-linux-gnu -I/export/users/nightly/gcc.svn/test-intel64corei7avx2/gcc-build-trunk/bld/x86_64-unknown-linux-gnu/32/libstdc++-v3/include -I/export/users/nightly/gcc.svn/test-intel64corei7avx2/gcc-build-trunk/src-trunk/libstdc++-v3/libsupc++  -std=gnu++11 -prefer-pic -D_GLIBCXX_SHARED -fno-implicit-templates  -Wall -Wextra -Wwrite-strings -Wcast-qual -Wabi  -fdiagnostics-show-location=once   -ffunction-sections -fdata-sections  -frandom-seed=functexcept.lo -g -O2 -D_GNU_SOURCE  -m32  -c -o functexcept.lo ../../../../../../src-trunk/libstdc++-v3/src/c++11/functexcept.cc
libtool: compile:  /export/users/nightly/gcc.svn/test-intel64corei7avx2/gcc-build-trunk/bld/./gcc/xgcc -shared-libgcc -B/export/users/nightly/gcc.svn/test-intel64corei7avx2/gcc-build-trunk/bld/./gcc -nostdinc++ -L/export/users/nightly/gcc.svn/test-intel64corei7avx2/gcc-build-trunk/bld/x86_64-unknown-linux-gnu/32/libstdc++-v3/src -L/export/users/nightly/gcc.svn/test-intel64corei7avx2/gcc-build-trunk/bld/x86_64-unknown-linux-gnu/32/libstdc++-v3/src/.libs -L/export/users/nightly/gcc.svn/test-intel64corei7avx2/gcc-build-trunk/bld/x86_64-unknown-linux-gnu/32/libstdc++-v3/libsupc++/.libs -B/usr/local/x86_64-unknown-linux-gnu/bin/ -B/usr/local/x86_64-unknown-linux-gnu/lib/ -isystem /usr/local/x86_64-unknown-linux-gnu/include -isystem /usr/local/x86_64-unknown-linux-gnu/sys-include -m32 -I/export/users/nightly/gcc.svn/test-intel64corei7avx2/gcc-build-trunk/src-trunk/libstdc++-v3/../libgcc -I/export/users/nightly/gcc.svn/test-intel64corei7avx2/gcc-build-trunk/bld/x86_64-unknown-linux-gnu/32/libstdc++-v3/include/x86_64-unknown-linux-gnu -I/export/users/nightly/gcc.svn/test-intel64corei7avx2/gcc-build-trunk/bld/x86_64-unknown-linux-gnu/32/libstdc++-v3/include -I/export/users/nightly/gcc.svn/test-intel64corei7avx2/gcc-build-trunk/src-trunk/libstdc++-v3/libsupc++ -std=gnu++11 -D_GLIBCXX_SHARED -fno-implicit-templates -Wall -Wextra -Wwrite-strings -Wcast-qual -Wabi -fdiagnostics-show-location=once -ffunction-sections -fdata-sections -frandom-seed=functexcept.lo -g -O2 -D_GNU_SOURCE -m32 -c ../../../../../../src-trunk/libstdc++-v3/src/c++11/functexcept.cc  -fPIC -DPIC -D_GLIBCXX_SHARED -o functexcept.o
/bin/sh ../../libtool --tag CXX --tag disable-shared   --mode=compile /export/users/nightly/gcc.svn/test-intel64corei7avx2/gcc-build-trunk/bld/./gcc/xgcc -shared-libgcc -B/export/users/nightly/gcc.svn/test-intel64corei7avx2/gcc-build-trunk/bld/./gcc -nostdinc++ -L/export/users/nightly/gcc.svn/test-intel64corei7avx2/gcc-build-trunk/bld/x86_64-unknown-linux-gnu/32/libstdc++-v3/src -L/export/users/nightly/gcc.svn/test-intel64corei7avx2/gcc-build-trunk/bld/x86_64-unknown-linux-gnu/32/libstdc++-v3/src/.libs -L/export/users/nightly/gcc.svn/test-intel64corei7avx2/gcc-build-trunk/bld/x86_64-unknown-linux-gnu/32/libstdc++-v3/libsupc++/.libs -B/usr/local/x86_64-unknown-linux-gnu/bin/ -B/usr/local/x86_64-unknown-linux-gnu/lib/ -isystem /usr/local/x86_64-unknown-linux-gnu/include -isystem /usr/local/x86_64-unknown-linux-gnu/sys-include  -m32 -I/export/users/nightly/gcc.svn/test-intel64corei7avx2/gcc-build-trunk/src-trunk/libstdc++-v3/../libgcc -I/export/users/nightly/gcc.svn/test-intel64corei7avx2/gcc-build-trunk/bld/x86_64-unknown-linux-gnu/32/libstdc++-v3/include/x86_64-unknown-linux-gnu -I/export/users/nightly/gcc.svn/test-intel64corei7avx2/gcc-build-trunk/bld/x86_64-unknown-linux-gnu/32/libstdc++-v3/include -I/export/users/nightly/gcc.svn/test-intel64corei7avx2/gcc-build-trunk/src-trunk/libstdc++-v3/libsupc++  -std=gnu++11 -prefer-pic -D_GLIBCXX_SHARED -fno-implicit-templates  -Wall -Wextra -Wwrite-strings -Wcast-qual -Wabi  -fdiagnostics-show-location=once   -ffunction-sections -fdata-sections  -frandom-seed=functional.lo -g -O2 -D_GNU_SOURCE  -m32  -c -o functional.lo ../../../../../../src-trunk/libstdc++-v3/src/c++11/functional.cc
libtool: compile:  /export/users/nightly/gcc.svn/test-intel64corei7avx2/gcc-build-trunk/bld/./gcc/xgcc -shared-libgcc -B/export/users/nightly/gcc.svn/test-intel64corei7avx2/gcc-build-trunk/bld/./gcc -nostdinc++ -L/export/users/nightly/gcc.svn/test-intel64corei7avx2/gcc-build-trunk/bld/x86_64-unknown-linux-gnu/32/libstdc++-v3/src -L/export/users/nightly/gcc.svn/test-intel64corei7avx2/gcc-build-trunk/bld/x86_64-unknown-linux-gnu/32/libstdc++-v3/src/.libs -L/export/users/nightly/gcc.svn/test-intel64corei7avx2/gcc-build-trunk/bld/x86_64-unknown-linux-gnu/32/libstdc++-v3/libsupc++/.libs -B/usr/local/x86_64-unknown-linux-gnu/bin/ -B/usr/local/x86_64-unknown-linux-gnu/lib/ -isystem /usr/local/x86_64-unknown-linux-gnu/include -isystem /usr/local/x86_64-unknown-linux-gnu/sys-include -m32 -I/export/users/nightly/gcc.svn/test-intel64corei7avx2/gcc-build-trunk/src-trunk/libstdc++-v3/../libgcc -I/export/users/nightly/gcc.svn/test-intel64corei7avx2/gcc-build-trunk/bld/x86_64-unknown-linux-gnu/32/libstdc++-v3/include/x86_64-unknown-linux-gnu -I/export/users/nightly/gcc.svn/test-intel64corei7avx2/gcc-build-trunk/bld/x86_64-unknown-linux-gnu/32/libstdc++-v3/include -I/export/users/nightly/gcc.svn/test-intel64corei7avx2/gcc-build-trunk/src-trunk/libstdc++-v3/libsupc++ -std=gnu++11 -D_GLIBCXX_SHARED -fno-implicit-templates -Wall -Wextra -Wwrite-strings -Wcast-qual -Wabi -fdiagnostics-show-location=once -ffunction-sections -fdata-sections -frandom-seed=functional.lo -g -O2 -D_GNU_SOURCE -m32 -c ../../../../../../src-trunk/libstdc++-v3/src/c++11/functional.cc  -fPIC -DPIC -D_GLIBCXX_SHARED -o functional.o
/bin/sh ../../libtool --tag CXX --tag disable-shared   --mode=compile /export/users/nightly/gcc.svn/test-intel64corei7avx2/gcc-build-trunk/bld/./gcc/xgcc -shared-libgcc -B/export/users/nightly/gcc.svn/test-intel64corei7avx2/gcc-build-trunk/bld/./gcc -nostdinc++ -L/export/users/nightly/gcc.svn/test-intel64corei7avx2/gcc-build-trunk/bld/x86_64-unknown-linux-gnu/32/libstdc++-v3/src -L/export/users/nightly/gcc.svn/test-intel64corei7avx2/gcc-build-trunk/bld/x86_64-unknown-linux-gnu/32/libstdc++-v3/src/.libs -L/export/users/nightly/gcc.svn/test-intel64corei7avx2/gcc-build-trunk/bld/x86_64-unknown-linux-gnu/32/libstdc++-v3/libsupc++/.libs -B/usr/local/x86_64-unknown-linux-gnu/bin/ -B/usr/local/x86_64-unknown-linux-gnu/lib/ -isystem /usr/local/x86_64-unknown-linux-gnu/include -isystem /usr/local/x86_64-unknown-linux-gnu/sys-include  -m32 -I/export/users/nightly/gcc.svn/test-intel64corei7avx2/gcc-build-trunk/src-trunk/libstdc++-v3/../libgcc -I/export/users/nightly/gcc.svn/test-intel64corei7avx2/gcc-build-trunk/bld/x86_64-unknown-linux-gnu/32/libstdc++-v3/include/x86_64-unknown-linux-gnu -I/export/users/nightly/gcc.svn/test-intel64corei7avx2/gcc-build-trunk/bld/x86_64-unknown-linux-gnu/32/libstdc++-v3/include -I/export/users/nightly/gcc.svn/test-intel64corei7avx2/gcc-build-trunk/src-trunk/libstdc++-v3/libsupc++  -std=gnu++11 -prefer-pic -D_GLIBCXX_SHARED -fno-implicit-templates  -Wall -Wextra -Wwrite-strings -Wcast-qual -Wabi  -fdiagnostics-show-location=once   -ffunction-sections -fdata-sections  -frandom-seed=future.lo -g -O2 -D_GNU_SOURCE  -m32  -c -o future.lo ../../../../../../src-trunk/libstdc++-v3/src/c++11/future.cc
libtool: compile:  /export/users/nightly/gcc.svn/test-intel64corei7avx2/gcc-build-trunk/bld/./gcc/xgcc -shared-libgcc -B/export/users/nightly/gcc.svn/test-intel64corei7avx2/gcc-build-trunk/bld/./gcc -nostdinc++ -L/export/users/nightly/gcc.svn/test-intel64corei7avx2/gcc-build-trunk/bld/x86_64-unknown-linux-gnu/32/libstdc++-v3/src -L/export/users/nightly/gcc.svn/test-intel64corei7avx2/gcc-build-trunk/bld/x86_64-unknown-linux-gnu/32/libstdc++-v3/src/.libs -L/export/users/nightly/gcc.svn/test-intel64corei7avx2/gcc-build-trunk/bld/x86_64-unknown-linux-gnu/32/libstdc++-v3/libsupc++/.libs -B/usr/local/x86_64-unknown-linux-gnu/bin/ -B/usr/local/x86_64-unknown-linux-gnu/lib/ -isystem /usr/local/x86_64-unknown-linux-gnu/include -isystem /usr/local/x86_64-unknown-linux-gnu/sys-include -m32 -I/export/users/nightly/gcc.svn/test-intel64corei7avx2/gcc-build-trunk/src-trunk/libstdc++-v3/../libgcc -I/export/users/nightly/gcc.svn/test-intel64corei7avx2/gcc-build-trunk/bld/x86_64-unknown-linux-gnu/32/libstdc++-v3/include/x86_64-unknown-linux-gnu -I/export/users/nightly/gcc.svn/test-intel64corei7avx2/gcc-build-trunk/bld/x86_64-unknown-linux-gnu/32/libstdc++-v3/include -I/export/users/nightly/gcc.svn/test-intel64corei7avx2/gcc-build-trunk/src-trunk/libstdc++-v3/libsupc++ -std=gnu++11 -D_GLIBCXX_SHARED -fno-implicit-templates -Wall -Wextra -Wwrite-strings -Wcast-qual -Wabi -fdiagnostics-show-location=once -ffunction-sections -fdata-sections -frandom-seed=future.lo -g -O2 -D_GNU_SOURCE -m32 -c ../../../../../../src-trunk/libstdc++-v3/src/c++11/future.cc  -fPIC -DPIC -D_GLIBCXX_SHARED -o future.o
/bin/sh ../../libtool --tag CXX --tag disable-shared   --mode=compile /export/users/nightly/gcc.svn/test-intel64corei7avx2/gcc-build-trunk/bld/./gcc/xgcc -shared-libgcc -B/export/users/nightly/gcc.svn/test-intel64corei7avx2/gcc-build-trunk/bld/./gcc -nostdinc++ -L/export/users/nightly/gcc.svn/test-intel64corei7avx2/gcc-build-trunk/bld/x86_64-unknown-linux-gnu/32/libstdc++-v3/src -L/export/users/nightly/gcc.svn/test-intel64corei7avx2/gcc-build-trunk/bld/x86_64-unknown-linux-gnu/32/libstdc++-v3/src/.libs -L/export/users/nightly/gcc.svn/test-intel64corei7avx2/gcc-build-trunk/bld/x86_64-unknown-linux-gnu/32/libstdc++-v3/libsupc++/.libs -B/usr/local/x86_64-unknown-linux-gnu/bin/ -B/usr/local/x86_64-unknown-linux-gnu/lib/ -isystem /usr/local/x86_64-unknown-linux-gnu/include -isystem /usr/local/x86_64-unknown-linux-gnu/sys-include  -m32 -I/export/users/nightly/gcc.svn/test-intel64corei7avx2/gcc-build-trunk/src-trunk/libstdc++-v3/../libgcc -I/export/users/nightly/gcc.svn/test-intel64corei7avx2/gcc-build-trunk/bld/x86_64-unknown-linux-gnu/32/libstdc++-v3/include/x86_64-unknown-linux-gnu -I/export/users/nightly/gcc.svn/test-intel64corei7avx2/gcc-build-trunk/bld/x86_64-unknown-linux-gnu/32/libstdc++-v3/include -I/export/users/nightly/gcc.svn/test-intel64corei7avx2/gcc-build-trunk/src-trunk/libstdc++-v3/libsupc++  -std=gnu++11 -prefer-pic -D_GLIBCXX_SHARED -fno-implicit-templates  -Wall -Wextra -Wwrite-strings -Wcast-qual -Wabi  -fdiagnostics-show-location=once   -ffunction-sections -fdata-sections  -frandom-seed=hash_c++0x.lo -g -O2 -D_GNU_SOURCE  -m32  -c -o hash_c++0x.lo ../../../../../../src-trunk/libstdc++-v3/src/c++11/hash_c++0x.cc
libtool: compile:  /export/users/nightly/gcc.svn/test-intel64corei7avx2/gcc-build-trunk/bld/./gcc/xgcc -shared-libgcc -B/export/users/nightly/gcc.svn/test-intel64corei7avx2/gcc-build-trunk/bld/./gcc -nostdinc++ -L/export/users/nightly/gcc.svn/test-intel64corei7avx2/gcc-build-trunk/bld/x86_64-unknown-linux-gnu/32/libstdc++-v3/src -L/export/users/nightly/gcc.svn/test-intel64corei7avx2/gcc-build-trunk/bld/x86_64-unknown-linux-gnu/32/libstdc++-v3/src/.libs -L/export/users/nightly/gcc.svn/test-intel64corei7avx2/gcc-build-trunk/bld/x86_64-unknown-linux-gnu/32/libstdc++-v3/libsupc++/.libs -B/usr/local/x86_64-unknown-linux-gnu/bin/ -B/usr/local/x86_64-unknown-linux-gnu/lib/ -isystem /usr/local/x86_64-unknown-linux-gnu/include -isystem /usr/local/x86_64-unknown-linux-gnu/sys-include -m32 -I/export/users/nightly/gcc.svn/test-intel64corei7avx2/gcc-build-trunk/src-trunk/libstdc++-v3/../libgcc -I/export/users/nightly/gcc.svn/test-intel64corei7avx2/gcc-build-trunk/bld/x86_64-unknown-linux-gnu/32/libstdc++-v3/include/x86_64-unknown-linux-gnu -I/export/users/nightly/gcc.svn/test-intel64corei7avx2/gcc-build-trunk/bld/x86_64-unknown-linux-gnu/32/libstdc++-v3/include -I/export/users/nightly/gcc.svn/test-intel64corei7avx2/gcc-build-trunk/src-trunk/libstdc++-v3/libsupc++ -std=gnu++11 -D_GLIBCXX_SHARED -fno-implicit-templates -Wall -Wextra -Wwrite-strings -Wcast-qual -Wabi -fdiagnostics-show-location=once -ffunction-sections -fdata-sections -frandom-seed=hash_c++0x.lo -g -O2 -D_GNU_SOURCE -m32 -c ../../../../../../src-trunk/libstdc++-v3/src/c++11/hash_c++0x.cc  -fPIC -DPIC -D_GLIBCXX_SHARED -o hash_c++0x.o
../../../../../../src-trunk/libstdc++-v3/src/c++11/hash_c++0x.cc: In member function ‘std::size_t std::hash<long double>::operator()(long double) const’:
../../../../../../src-trunk/libstdc++-v3/src/c++11/hash_c++0x.cc:56:3: error: insn does not satisfy its constraints:
   }
   ^
(insn 118 46 47 6 (set (reg:DI 2 cx)
        (reg:DI 21 xmm0)) ../../../../../../src-trunk/libstdc++-v3/src/c++11/hash_c++0x.cc:50 89 {*movdi_internal}
     (expr_list:REG_UNUSED (reg:SI 3 bx)
        (nil)))
../../../../../../src-trunk/libstdc++-v3/src/c++11/hash_c++0x.cc:56:3: internal compiler error: in copyprop_hardreg_forward_1, at regcprop.c:776
0xd1de8b _fatal_insn(char const*, rtx_def const*, char const*, int, char const*)
	../../src-trunk/gcc/rtl-error.c:109
0xd1deeb _fatal_insn_not_found(rtx_def const*, char const*, int, char const*)
	../../src-trunk/gcc/rtl-error.c:120
0xce071e copyprop_hardreg_forward_1
	../../src-trunk/gcc/regcprop.c:776
0xce1fd7 execute
	../../src-trunk/gcc/regcprop.c:1264
Please submit a full bug report,
with preprocessed source if appropriate.
Please include the complete backtrace with any bug report.
See <http://gcc.gnu.org/bugs.html> for instructions.
make[13]: *** [hash_c++0x.lo] Error 1
make[13]: *** Waiting for unfinished jobs....
make[13]: Leaving directory `/export/users/nightly/gcc.svn/test-intel64corei7avx2/gcc-build-trunk/bld/x86_64-unknown-linux-gnu/32/libstdc++-v3/src/c++11'
make[13]: Entering directory `/export/users/nightly/gcc.svn/test-intel64corei7avx2/gcc-build-trunk/bld/x86_64-unknown-linux-gnu/32/libstdc++-v3/src'
/bin/sh ../libtool --tag CXX   --mode=compile /export/users/nightly/gcc.svn/test-intel64corei7avx2/gcc-build-trunk/bld/./gcc/xgcc -shared-libgcc -B/export/users/nightly/gcc.svn/test-intel64corei7avx2/gcc-build-trunk/bld/./gcc -nostdinc++ -L/export/users/nightly/gcc.svn/test-intel64corei7avx2/gcc-build-trunk/bld/x86_64-unknown-linux-gnu/32/libstdc++-v3/src -L/export/users/nightly/gcc.svn/test-intel64corei7avx2/gcc-build-trunk/bld/x86_64-unknown-linux-gnu/32/libstdc++-v3/src/.libs -L/export/users/nightly/gcc.svn/test-intel64corei7avx2/gcc-build-trunk/bld/x86_64-unknown-linux-gnu/32/libstdc++-v3/libsupc++/.libs -B/usr/local/x86_64-unknown-linux-gnu/bin/ -B/usr/local/x86_64-unknown-linux-gnu/lib/ -isystem /usr/local/x86_64-unknown-linux-gnu/include -isystem /usr/local/x86_64-unknown-linux-gnu/sys-include  -m32  -I/export/users/nightly/gcc.svn/test-intel64corei7avx2/gcc-build-trunk/bld/x86_64-unknown-linux-gnu/32/libstdc++-v3/include/x86_64-unknown-linux-gnu -I/export/users/nightly/gcc.svn/test-intel64corei7avx2/gcc-build-trunk/bld/x86_64-unknown-linux-gnu/32/libstdc++-v3/include -I/export/users/nightly/gcc.svn/test-intel64corei7avx2/gcc-build-trunk/src-trunk/libstdc++-v3/libsupc++  -fPIC -DPIC -fno-implicit-templates  -Wall -Wextra -Wwrite-strings -Wcast-qual -Wabi  -fdiagnostics-show-location=once   -ffunction-sections -fdata-sections  -frandom-seed=compatibility.lo -g -O2 -D_GNU_SOURCE  -m32  -c -o compatibility.lo ../../../../../src-trunk/libstdc++-v3/src/c++98/compatibility.cc
/bin/sh ../libtool --tag CXX   --mode=compile /export/users/nightly/gcc.svn/test-intel64corei7avx2/gcc-build-trunk/bld/./gcc/xgcc -shared-libgcc -B/export/users/nightly/gcc.svn/test-intel64corei7avx2/gcc-build-trunk/bld/./gcc -nostdinc++ -L/export/users/nightly/gcc.svn/test-intel64corei7avx2/gcc-build-trunk/bld/x86_64-unknown-linux-gnu/32/libstdc++-v3/src -L/export/users/nightly/gcc.svn/test-intel64corei7avx2/gcc-build-trunk/bld/x86_64-unknown-linux-gnu/32/libstdc++-v3/src/.libs -L/export/users/nightly/gcc.svn/test-intel64corei7avx2/gcc-build-trunk/bld/x86_64-unknown-linux-gnu/32/libstdc++-v3/libsupc++/.libs -B/usr/local/x86_64-unknown-linux-gnu/bin/ -B/usr/local/x86_64-unknown-linux-gnu/lib/ -isystem /usr/local/x86_64-unknown-linux-gnu/include -isystem /usr/local/x86_64-unknown-linux-gnu/sys-include  -m32  -I/export/users/nightly/gcc.svn/test-intel64corei7avx2/gcc-build-trunk/bld/x86_64-unknown-linux-gnu/32/libstdc++-v3/include/x86_64-unknown-linux-gnu -I/export/users/nightly/gcc.svn/test-intel64corei7avx2/gcc-build-trunk/bld/x86_64-unknown-linux-gnu/32/libstdc++-v3/include -I/export/users/nightly/gcc.svn/test-intel64corei7avx2/gcc-build-trunk/src-trunk/libstdc++-v3/libsupc++  -fPIC -DPIC -fno-implicit-templates  -Wall -Wextra -Wwrite-strings -Wcast-qual -Wabi  -fdiagnostics-show-location=once   -ffunction-sections -fdata-sections  -frandom-seed=compatibility-debug_list.lo -g -O2 -D_GNU_SOURCE  -m32  -c -o compatibility-debug_list.lo ../../../../../src-trunk/libstdc++-v3/src/c++98/compatibility-debug_list.cc
libtool: compile:  /export/users/nightly/gcc.svn/test-intel64corei7avx2/gcc-build-trunk/bld/./gcc/xgcc -shared-libgcc -B/export/users/nightly/gcc.svn/test-intel64corei7avx2/gcc-build-trunk/bld/./gcc -nostdinc++ -L/export/users/nightly/gcc.svn/test-intel64corei7avx2/gcc-build-trunk/bld/x86_64-unknown-linux-gnu/32/libstdc++-v3/src -L/export/users/nightly/gcc.svn/test-intel64corei7avx2/gcc-build-trunk/bld/x86_64-unknown-linux-gnu/32/libstdc++-v3/src/.libs -L/export/users/nightly/gcc.svn/test-intel64corei7avx2/gcc-build-trunk/bld/x86_64-unknown-linux-gnu/32/libstdc++-v3/libsupc++/.libs -B/usr/local/x86_64-unknown-linux-gnu/bin/ -B/usr/local/x86_64-unknown-linux-gnu/lib/ -isystem /usr/local/x86_64-unknown-linux-gnu/include -isystem /usr/local/x86_64-unknown-linux-gnu/sys-include -m32 -I/export/users/nightly/gcc.svn/test-intel64corei7avx2/gcc-build-trunk/bld/x86_64-unknown-linux-gnu/32/libstdc++-v3/include/x86_64-unknown-linux-gnu -I/export/users/nightly/gcc.svn/test-intel64corei7avx2/gcc-build-trunk/bld/x86_64-unknown-linux-gnu/32/libstdc++-v3/include -I/export/users/nightly/gcc.svn/test-intel64corei7avx2/gcc-build-trunk/src-trunk/libstdc++-v3/libsupc++ -fPIC -DPIC -fno-implicit-templates -Wall -Wextra -Wwrite-strings -Wcast-qual -Wabi -fdiagnostics-show-location=once -ffunction-sections -fdata-sections -frandom-seed=compatibility.lo -g -O2 -D_GNU_SOURCE -m32 -c ../../../../../src-trunk/libstdc++-v3/src/c++98/compatibility.cc  -fPIC -DPIC -D_GLIBCXX_SHARED -o .libs/compatibility.o
libtool: compile:  /export/users/nightly/gcc.svn/test-intel64corei7avx2/gcc-build-trunk/bld/./gcc/xgcc -shared-libgcc -B/export/users/nightly/gcc.svn/test-intel64corei7avx2/gcc-build-trunk/bld/./gcc -nostdinc++ -L/export/users/nightly/gcc.svn/test-intel64corei7avx2/gcc-build-trunk/bld/x86_64-unknown-linux-gnu/32/libstdc++-v3/src -L/export/users/nightly/gcc.svn/test-intel64corei7avx2/gcc-build-trunk/bld/x86_64-unknown-linux-gnu/32/libstdc++-v3/src/.libs -L/export/users/nightly/gcc.svn/test-intel64corei7avx2/gcc-build-trunk/bld/x86_64-unknown-linux-gnu/32/libstdc++-v3/libsupc++/.libs -B/usr/local/x86_64-unknown-linux-gnu/bin/ -B/usr/local/x86_64-unknown-linux-gnu/lib/ -isystem /usr/local/x86_64-unknown-linux-gnu/include -isystem /usr/local/x86_64-unknown-linux-gnu/sys-include -m32 -I/export/users/nightly/gcc.svn/test-intel64corei7avx2/gcc-build-trunk/bld/x86_64-unknown-linux-gnu/32/libstdc++-v3/include/x86_64-unknown-linux-gnu -I/export/users/nightly/gcc.svn/test-intel64corei7avx2/gcc-build-trunk/bld/x86_64-unknown-linux-gnu/32/libstdc++-v3/include -I/export/users/nightly/gcc.svn/test-intel64corei7avx2/gcc-build-trunk/src-trunk/libstdc++-v3/libsupc++ -fPIC -DPIC -fno-implicit-templates -Wall -Wextra -Wwrite-strings -Wcast-qual -Wabi -fdiagnostics-show-location=once -ffunction-sections -fdata-sections -frandom-seed=compatibility-debug_list.lo -g -O2 -D_GNU_SOURCE -m32 -c ../../../../../src-trunk/libstdc++-v3/src/c++98/compatibility-debug_list.cc  -fPIC -DPIC -D_GLIBCXX_SHARED -o .libs/compatibility-debug_list.o
libtool: compile:  /export/users/nightly/gcc.svn/test-intel64corei7avx2/gcc-build-trunk/bld/./gcc/xgcc -shared-libgcc -B/export/users/nightly/gcc.svn/test-intel64corei7avx2/gcc-build-trunk/bld/./gcc -nostdinc++ -L/export/users/nightly/gcc.svn/test-intel64corei7avx2/gcc-build-trunk/bld/x86_64-unknown-linux-gnu/32/libstdc++-v3/src -L/export/users/nightly/gcc.svn/test-intel64corei7avx2/gcc-build-trunk/bld/x86_64-unknown-linux-gnu/32/libstdc++-v3/src/.libs -L/export/users/nightly/gcc.svn/test-intel64corei7avx2/gcc-build-trunk/bld/x86_64-unknown-linux-gnu/32/libstdc++-v3/libsupc++/.libs -B/usr/local/x86_64-unknown-linux-gnu/bin/ -B/usr/local/x86_64-unknown-linux-gnu/lib/ -isystem /usr/local/x86_64-unknown-linux-gnu/include -isystem /usr/local/x86_64-unknown-linux-gnu/sys-include -m32 -I/export/users/nightly/gcc.svn/test-intel64corei7avx2/gcc-build-trunk/bld/x86_64-unknown-linux-gnu/32/libstdc++-v3/include/x86_64-unknown-linux-gnu -I/export/users/nightly/gcc.svn/test-intel64corei7avx2/gcc-build-trunk/bld/x86_64-unknown-linux-gnu/32/libstdc++-v3/include -I/export/users/nightly/gcc.svn/test-intel64corei7avx2/gcc-build-trunk/src-trunk/libstdc++-v3/libsupc++ -fPIC -DPIC -fno-implicit-templates -Wall -Wextra -Wwrite-strings -Wcast-qual -Wabi -fdiagnostics-show-location=once -ffunction-sections -fdata-sections -frandom-seed=compatibility-debug_list.lo -g -O2 -D_GNU_SOURCE -m32 -c ../../../../../src-trunk/libstdc++-v3/src/c++98/compatibility-debug_list.cc -o compatibility-debug_list.o >/dev/null 2>&1
/bin/sh ../libtool --tag CXX   --mode=compile /export/users/nightly/gcc.svn/test-intel64corei7avx2/gcc-build-trunk/bld/./gcc/xgcc -shared-libgcc -B/export/users/nightly/gcc.svn/test-intel64corei7avx2/gcc-build-trunk/bld/./gcc -nostdinc++ -L/export/users/nightly/gcc.svn/test-intel64corei7avx2/gcc-build-trunk/bld/x86_64-unknown-linux-gnu/32/libstdc++-v3/src -L/export/users/nightly/gcc.svn/test-intel64corei7avx2/gcc-build-trunk/bld/x86_64-unknown-linux-gnu/32/libstdc++-v3/src/.libs -L/export/users/nightly/gcc.svn/test-intel64corei7avx2/gcc-build-trunk/bld/x86_64-unknown-linux-gnu/32/libstdc++-v3/libsupc++/.libs -B/usr/local/x86_64-unknown-linux-gnu/bin/ -B/usr/local/x86_64-unknown-linux-gnu/lib/ -isystem /usr/local/x86_64-unknown-linux-gnu/include -isystem /usr/local/x86_64-unknown-linux-gnu/sys-include  -m32  -I/export/users/nightly/gcc.svn/test-intel64corei7avx2/gcc-build-trunk/bld/x86_64-unknown-linux-gnu/32/libstdc++-v3/include/x86_64-unknown-linux-gnu -I/export/users/nightly/gcc.svn/test-intel64corei7avx2/gcc-build-trunk/bld/x86_64-unknown-linux-gnu/32/libstdc++-v3/include -I/export/users/nightly/gcc.svn/test-intel64corei7avx2/gcc-build-trunk/src-trunk/libstdc++-v3/libsupc++  -fPIC -DPIC -fno-implicit-templates  -Wall -Wextra -Wwrite-strings -Wcast-qual -Wabi  -fdiagnostics-show-location=once   -ffunction-sections -fdata-sections  -frandom-seed=compatibility-debug_list-2.lo -g -O2 -D_GNU_SOURCE  -m32  -c -o compatibility-debug_list-2.lo ../../../../../src-trunk/libstdc++-v3/src/c++98/compatibility-debug_list-2.cc
libtool: compile:  /export/users/nightly/gcc.svn/test-intel64corei7avx2/gcc-build-trunk/bld/./gcc/xgcc -shared-libgcc -B/export/users/nightly/gcc.svn/test-intel64corei7avx2/gcc-build-trunk/bld/./gcc -nostdinc++ -L/export/users/nightly/gcc.svn/test-intel64corei7avx2/gcc-build-trunk/bld/x86_64-unknown-linux-gnu/32/libstdc++-v3/src -L/export/users/nightly/gcc.svn/test-intel64corei7avx2/gcc-build-trunk/bld/x86_64-unknown-linux-gnu/32/libstdc++-v3/src/.libs -L/export/users/nightly/gcc.svn/test-intel64corei7avx2/gcc-build-trunk/bld/x86_64-unknown-linux-gnu/32/libstdc++-v3/libsupc++/.libs -B/usr/local/x86_64-unknown-linux-gnu/bin/ -B/usr/local/x86_64-unknown-linux-gnu/lib/ -isystem /usr/local/x86_64-unknown-linux-gnu/include -isystem /usr/local/x86_64-unknown-linux-gnu/sys-include -m32 -I/export/users/nightly/gcc.svn/test-intel64corei7avx2/gcc-build-trunk/bld/x86_64-unknown-linux-gnu/32/libstdc++-v3/include/x86_64-unknown-linux-gnu -I/export/users/nightly/gcc.svn/test-intel64corei7avx2/gcc-build-trunk/bld/x86_64-unknown-linux-gnu/32/libstdc++-v3/include -I/export/users/nightly/gcc.svn/test-intel64corei7avx2/gcc-build-trunk/src-trunk/libstdc++-v3/libsupc++ -fPIC -DPIC -fno-implicit-templates -Wall -Wextra -Wwrite-strings -Wcast-qual -Wabi -fdiagnostics-show-location=once -ffunction-sections -fdata-sections -frandom-seed=compatibility-debug_list-2.lo -g -O2 -D_GNU_SOURCE -m32 -c ../../../../../src-trunk/libstdc++-v3/src/c++98/compatibility-debug_list-2.cc  -fPIC -DPIC -D_GLIBCXX_SHARED -o .libs/compatibility-debug_list-2.o
libtool: compile:  /export/users/nightly/gcc.svn/test-intel64corei7avx2/gcc-build-trunk/bld/./gcc/xgcc -shared-libgcc -B/export/users/nightly/gcc.svn/test-intel64corei7avx2/gcc-build-trunk/bld/./gcc -nostdinc++ -L/export/users/nightly/gcc.svn/test-intel64corei7avx2/gcc-build-trunk/bld/x86_64-unknown-linux-gnu/32/libstdc++-v3/src -L/export/users/nightly/gcc.svn/test-intel64corei7avx2/gcc-build-trunk/bld/x86_64-unknown-linux-gnu/32/libstdc++-v3/src/.libs -L/export/users/nightly/gcc.svn/test-intel64corei7avx2/gcc-build-trunk/bld/x86_64-unknown-linux-gnu/32/libstdc++-v3/libsupc++/.libs -B/usr/local/x86_64-unknown-linux-gnu/bin/ -B/usr/local/x86_64-unknown-linux-gnu/lib/ -isystem /usr/local/x86_64-unknown-linux-gnu/include -isystem /usr/local/x86_64-unknown-linux-gnu/sys-include -m32 -I/export/users/nightly/gcc.svn/test-intel64corei7avx2/gcc-build-trunk/bld/x86_64-unknown-linux-gnu/32/libstdc++-v3/include/x86_64-unknown-linux-gnu -I/export/users/nightly/gcc.svn/test-intel64corei7avx2/gcc-build-trunk/bld/x86_64-unknown-linux-gnu/32/libstdc++-v3/include -I/export/users/nightly/gcc.svn/test-intel64corei7avx2/gcc-build-trunk/src-trunk/libstdc++-v3/libsupc++ -fPIC -DPIC -fno-implicit-templates -Wall -Wextra -Wwrite-strings -Wcast-qual -Wabi -fdiagnostics-show-location=once -ffunction-sections -fdata-sections -frandom-seed=compatibility-debug_list-2.lo -g -O2 -D_GNU_SOURCE -m32 -c ../../../../../src-trunk/libstdc++-v3/src/c++98/compatibility-debug_list-2.cc -o compatibility-debug_list-2.o >/dev/null 2>&1
/bin/sh ../libtool --tag CXX   --mode=compile /export/users/nightly/gcc.svn/test-intel64corei7avx2/gcc-build-trunk/bld/./gcc/xgcc -shared-libgcc -B/export/users/nightly/gcc.svn/test-intel64corei7avx2/gcc-build-trunk/bld/./gcc -nostdinc++ -L/export/users/nightly/gcc.svn/test-intel64corei7avx2/gcc-build-trunk/bld/x86_64-unknown-linux-gnu/32/libstdc++-v3/src -L/export/users/nightly/gcc.svn/test-intel64corei7avx2/gcc-build-trunk/bld/x86_64-unknown-linux-gnu/32/libstdc++-v3/src/.libs -L/export/users/nightly/gcc.svn/test-intel64corei7avx2/gcc-build-trunk/bld/x86_64-unknown-linux-gnu/32/libstdc++-v3/libsupc++/.libs -B/usr/local/x86_64-unknown-linux-gnu/bin/ -B/usr/local/x86_64-unknown-linux-gnu/lib/ -isystem /usr/local/x86_64-unknown-linux-gnu/include -isystem /usr/local/x86_64-unknown-linux-gnu/sys-include  -m32  -I/export/users/nightly/gcc.svn/test-intel64corei7avx2/gcc-build-trunk/bld/x86_64-unknown-linux-gnu/32/libstdc++-v3/include/x86_64-unknown-linux-gnu -I/export/users/nightly/gcc.svn/test-intel64corei7avx2/gcc-build-trunk/bld/x86_64-unknown-linux-gnu/32/libstdc++-v3/include -I/export/users/nightly/gcc.svn/test-intel64corei7avx2/gcc-build-trunk/src-trunk/libstdc++-v3/libsupc++  -fPIC -DPIC -fno-implicit-templates  -Wall -Wextra -Wwrite-strings -Wcast-qual -Wabi  -fdiagnostics-show-location=once   -ffunction-sections -fdata-sections  -frandom-seed=compatibility-c++0x.lo -g -O2 -D_GNU_SOURCE  -m32  -std=gnu++11 -c ../../../../../src-trunk/libstdc++-v3/src/c++11/compatibility-c++0x.cc
libtool: compile:  /export/users/nightly/gcc.svn/test-intel64corei7avx2/gcc-build-trunk/bld/./gcc/xgcc -shared-libgcc -B/export/users/nightly/gcc.svn/test-intel64corei7avx2/gcc-build-trunk/bld/./gcc -nostdinc++ -L/export/users/nightly/gcc.svn/test-intel64corei7avx2/gcc-build-trunk/bld/x86_64-unknown-linux-gnu/32/libstdc++-v3/src -L/export/users/nightly/gcc.svn/test-intel64corei7avx2/gcc-build-trunk/bld/x86_64-unknown-linux-gnu/32/libstdc++-v3/src/.libs -L/export/users/nightly/gcc.svn/test-intel64corei7avx2/gcc-build-trunk/bld/x86_64-unknown-linux-gnu/32/libstdc++-v3/libsupc++/.libs -B/usr/local/x86_64-unknown-linux-gnu/bin/ -B/usr/local/x86_64-unknown-linux-gnu/lib/ -isystem /usr/local/x86_64-unknown-linux-gnu/include -isystem /usr/local/x86_64-unknown-linux-gnu/sys-include -m32 -I/export/users/nightly/gcc.svn/test-intel64corei7avx2/gcc-build-trunk/bld/x86_64-unknown-linux-gnu/32/libstdc++-v3/include/x86_64-unknown-linux-gnu -I/export/users/nightly/gcc.svn/test-intel64corei7avx2/gcc-build-trunk/bld/x86_64-unknown-linux-gnu/32/libstdc++-v3/include -I/export/users/nightly/gcc.svn/test-intel64corei7avx2/gcc-build-trunk/src-trunk/libstdc++-v3/libsupc++ -fPIC -DPIC -fno-implicit-templates -Wall -Wextra -Wwrite-strings -Wcast-qual -Wabi -fdiagnostics-show-location=once -ffunction-sections -fdata-sections -frandom-seed=compatibility-c++0x.lo -g -O2 -D_GNU_SOURCE -m32 -std=gnu++11 -c ../../../../../src-trunk/libstdc++-v3/src/c++11/compatibility-c++0x.cc  -fPIC -DPIC -D_GLIBCXX_SHARED -o .libs/compatibility-c++0x.o
libtool: compile:  /export/users/nightly/gcc.svn/test-intel64corei7avx2/gcc-build-trunk/bld/./gcc/xgcc -shared-libgcc -B/export/users/nightly/gcc.svn/test-intel64corei7avx2/gcc-build-trunk/bld/./gcc -nostdinc++ -L/export/users/nightly/gcc.svn/test-intel64corei7avx2/gcc-build-trunk/bld/x86_64-unknown-linux-gnu/32/libstdc++-v3/src -L/export/users/nightly/gcc.svn/test-intel64corei7avx2/gcc-build-trunk/bld/x86_64-unknown-linux-gnu/32/libstdc++-v3/src/.libs -L/export/users/nightly/gcc.svn/test-intel64corei7avx2/gcc-build-trunk/bld/x86_64-unknown-linux-gnu/32/libstdc++-v3/libsupc++/.libs -B/usr/local/x86_64-unknown-linux-gnu/bin/ -B/usr/local/x86_64-unknown-linux-gnu/lib/ -isystem /usr/local/x86_64-unknown-linux-gnu/include -isystem /usr/local/x86_64-unknown-linux-gnu/sys-include -m32 -I/export/users/nightly/gcc.svn/test-intel64corei7avx2/gcc-build-trunk/bld/x86_64-unknown-linux-gnu/32/libstdc++-v3/include/x86_64-unknown-linux-gnu -I/export/users/nightly/gcc.svn/test-intel64corei7avx2/gcc-build-trunk/bld/x86_64-unknown-linux-gnu/32/libstdc++-v3/include -I/export/users/nightly/gcc.svn/test-intel64corei7avx2/gcc-build-trunk/src-trunk/libstdc++-v3/libsupc++ -fPIC -DPIC -fno-implicit-templates -Wall -Wextra -Wwrite-strings -Wcast-qual -Wabi -fdiagnostics-show-location=once -ffunction-sections -fdata-sections -frandom-seed=compatibility-c++0x.lo -g -O2 -D_GNU_SOURCE -m32 -std=gnu++11 -c ../../../../../src-trunk/libstdc++-v3/src/c++11/compatibility-c++0x.cc -o compatibility-c++0x.o >/dev/null 2>&1
/bin/sh ../libtool --tag CXX   --mode=compile /export/users/nightly/gcc.svn/test-intel64corei7avx2/gcc-build-trunk/bld/./gcc/xgcc -shared-libgcc -B/export/users/nightly/gcc.svn/test-intel64corei7avx2/gcc-build-trunk/bld/./gcc -nostdinc++ -L/export/users/nightly/gcc.svn/test-intel64corei7avx2/gcc-build-trunk/bld/x86_64-unknown-linux-gnu/32/libstdc++-v3/src -L/export/users/nightly/gcc.svn/test-intel64corei7avx2/gcc-build-trunk/bld/x86_64-unknown-linux-gnu/32/libstdc++-v3/src/.libs -L/export/users/nightly/gcc.svn/test-intel64corei7avx2/gcc-build-trunk/bld/x86_64-unknown-linux-gnu/32/libstdc++-v3/libsupc++/.libs -B/usr/local/x86_64-unknown-linux-gnu/bin/ -B/usr/local/x86_64-unknown-linux-gnu/lib/ -isystem /usr/local/x86_64-unknown-linux-gnu/include -isystem /usr/local/x86_64-unknown-linux-gnu/sys-include  -m32  -I/export/users/nightly/gcc.svn/test-intel64corei7avx2/gcc-build-trunk/bld/x86_64-unknown-linux-gnu/32/libstdc++-v3/include/x86_64-unknown-linux-gnu -I/export/users/nightly/gcc.svn/test-intel64corei7avx2/gcc-build-trunk/bld/x86_64-unknown-linux-gnu/32/libstdc++-v3/include -I/export/users/nightly/gcc.svn/test-intel64corei7avx2/gcc-build-trunk/src-trunk/libstdc++-v3/libsupc++  -fPIC -DPIC -fno-implicit-templates  -Wall -Wextra -Wwrite-strings -Wcast-qual -Wabi  -fdiagnostics-show-location=once   -ffunction-sections -fdata-sections  -frandom-seed=compatibility-atomic-c++0x.lo -g -O2 -D_GNU_SOURCE  -m32  -std=gnu++11 -c ../../../../../src-trunk/libstdc++-v3/src/c++11/compatibility-atomic-c++0x.cc
libtool: compile:  /export/users/nightly/gcc.svn/test-intel64corei7avx2/gcc-build-trunk/bld/./gcc/xgcc -shared-libgcc -B/export/users/nightly/gcc.svn/test-intel64corei7avx2/gcc-build-trunk/bld/./gcc -nostdinc++ -L/export/users/nightly/gcc.svn/test-intel64corei7avx2/gcc-build-trunk/bld/x86_64-unknown-linux-gnu/32/libstdc++-v3/src -L/export/users/nightly/gcc.svn/test-intel64corei7avx2/gcc-build-trunk/bld/x86_64-unknown-linux-gnu/32/libstdc++-v3/src/.libs -L/export/users/nightly/gcc.svn/test-intel64corei7avx2/gcc-build-trunk/bld/x86_64-unknown-linux-gnu/32/libstdc++-v3/libsupc++/.libs -B/usr/local/x86_64-unknown-linux-gnu/bin/ -B/usr/local/x86_64-unknown-linux-gnu/lib/ -isystem /usr/local/x86_64-unknown-linux-gnu/include -isystem /usr/local/x86_64-unknown-linux-gnu/sys-include -m32 -I/export/users/nightly/gcc.svn/test-intel64corei7avx2/gcc-build-trunk/bld/x86_64-unknown-linux-gnu/32/libstdc++-v3/include/x86_64-unknown-linux-gnu -I/export/users/nightly/gcc.svn/test-intel64corei7avx2/gcc-build-trunk/bld/x86_64-unknown-linux-gnu/32/libstdc++-v3/include -I/export/users/nightly/gcc.svn/test-intel64corei7avx2/gcc-build-trunk/src-trunk/libstdc++-v3/libsupc++ -fPIC -DPIC -fno-implicit-templates -Wall -Wextra -Wwrite-strings -Wcast-qual -Wabi -fdiagnostics-show-location=once -ffunction-sections -fdata-sections -frandom-seed=compatibility-atomic-c++0x.lo -g -O2 -D_GNU_SOURCE -m32 -std=gnu++11 -c ../../../../../src-trunk/libstdc++-v3/src/c++11/compatibility-atomic-c++0x.cc  -fPIC -DPIC -D_GLIBCXX_SHARED -o .libs/compatibility-atomic-c++0x.o
libtool: compile:  /export/users/nightly/gcc.svn/test-intel64corei7avx2/gcc-build-trunk/bld/./gcc/xgcc -shared-libgcc -B/export/users/nightly/gcc.svn/test-intel64corei7avx2/gcc-build-trunk/bld/./gcc -nostdinc++ -L/export/users/nightly/gcc.svn/test-intel64corei7avx2/gcc-build-trunk/bld/x86_64-unknown-linux-gnu/32/libstdc++-v3/src -L/export/users/nightly/gcc.svn/test-intel64corei7avx2/gcc-build-trunk/bld/x86_64-unknown-linux-gnu/32/libstdc++-v3/src/.libs -L/export/users/nightly/gcc.svn/test-intel64corei7avx2/gcc-build-trunk/bld/x86_64-unknown-linux-gnu/32/libstdc++-v3/libsupc++/.libs -B/usr/local/x86_64-unknown-linux-gnu/bin/ -B/usr/local/x86_64-unknown-linux-gnu/lib/ -isystem /usr/local/x86_64-unknown-linux-gnu/include -isystem /usr/local/x86_64-unknown-linux-gnu/sys-include -m32 -I/export/users/nightly/gcc.svn/test-intel64corei7avx2/gcc-build-trunk/bld/x86_64-unknown-linux-gnu/32/libstdc++-v3/include/x86_64-unknown-linux-gnu -I/export/users/nightly/gcc.svn/test-intel64corei7avx2/gcc-build-trunk/bld/x86_64-unknown-linux-gnu/32/libstdc++-v3/include -I/export/users/nightly/gcc.svn/test-intel64corei7avx2/gcc-build-trunk/src-trunk/libstdc++-v3/libsupc++ -fPIC -DPIC -fno-implicit-templates -Wall -Wextra -Wwrite-strings -Wcast-qual -Wabi -fdiagnostics-show-location=once -ffunction-sections -fdata-sections -frandom-seed=compatibility.lo -g -O2 -D_GNU_SOURCE -m32 -c ../../../../../src-trunk/libstdc++-v3/src/c++98/compatibility.cc -o compatibility.o >/dev/null 2>&1
libtool: compile:  /export/users/nightly/gcc.svn/test-intel64corei7avx2/gcc-build-trunk/bld/./gcc/xgcc -shared-libgcc -B/export/users/nightly/gcc.svn/test-intel64corei7avx2/gcc-build-trunk/bld/./gcc -nostdinc++ -L/export/users/nightly/gcc.svn/test-intel64corei7avx2/gcc-build-trunk/bld/x86_64-unknown-linux-gnu/32/libstdc++-v3/src -L/export/users/nightly/gcc.svn/test-intel64corei7avx2/gcc-build-trunk/bld/x86_64-unknown-linux-gnu/32/libstdc++-v3/src/.libs -L/export/users/nightly/gcc.svn/test-intel64corei7avx2/gcc-build-trunk/bld/x86_64-unknown-linux-gnu/32/libstdc++-v3/libsupc++/.libs -B/usr/local/x86_64-unknown-linux-gnu/bin/ -B/usr/local/x86_64-unknown-linux-gnu/lib/ -isystem /usr/local/x86_64-unknown-linux-gnu/include -isystem /usr/local/x86_64-unknown-linux-gnu/sys-include -m32 -I/export/users/nightly/gcc.svn/test-intel64corei7avx2/gcc-build-trunk/bld/x86_64-unknown-linux-gnu/32/libstdc++-v3/include/x86_64-unknown-linux-gnu -I/export/users/nightly/gcc.svn/test-intel64corei7avx2/gcc-build-trunk/bld/x86_64-unknown-linux-gnu/32/libstdc++-v3/include -I/export/users/nightly/gcc.svn/test-intel64corei7avx2/gcc-build-trunk/src-trunk/libstdc++-v3/libsupc++ -fPIC -DPIC -fno-implicit-templates -Wall -Wextra -Wwrite-strings -Wcast-qual -Wabi -fdiagnostics-show-location=once -ffunction-sections -fdata-sections -frandom-seed=compatibility-atomic-c++0x.lo -g -O2 -D_GNU_SOURCE -m32 -std=gnu++11 -c ../../../../../src-trunk/libstdc++-v3/src/c++11/compatibility-atomic-c++0x.cc -o compatibility-atomic-c++0x.o >/dev/null 2>&1
/bin/sh ../libtool --tag CXX   --mode=compile /export/users/nightly/gcc.svn/test-intel64corei7avx2/gcc-build-trunk/bld/./gcc/xgcc -shared-libgcc -B/export/users/nightly/gcc.svn/test-intel64corei7avx2/gcc-build-trunk/bld/./gcc -nostdinc++ -L/export/users/nightly/gcc.svn/test-intel64corei7avx2/gcc-build-trunk/bld/x86_64-unknown-linux-gnu/32/libstdc++-v3/src -L/export/users/nightly/gcc.svn/test-intel64corei7avx2/gcc-build-trunk/bld/x86_64-unknown-linux-gnu/32/libstdc++-v3/src/.libs -L/export/users/nightly/gcc.svn/test-intel64corei7avx2/gcc-build-trunk/bld/x86_64-unknown-linux-gnu/32/libstdc++-v3/libsupc++/.libs -B/usr/local/x86_64-unknown-linux-gnu/bin/ -B/usr/local/x86_64-unknown-linux-gnu/lib/ -isystem /usr/local/x86_64-unknown-linux-gnu/include -isystem /usr/local/x86_64-unknown-linux-gnu/sys-include  -m32  -I/export/users/nightly/gcc.svn/test-intel64corei7avx2/gcc-build-trunk/bld/x86_64-unknown-linux-gnu/32/libstdc++-v3/include/x86_64-unknown-linux-gnu -I/export/users/nightly/gcc.svn/test-intel64corei7avx2/gcc-build-trunk/bld/x86_64-unknown-linux-gnu/32/libstdc++-v3/include -I/export/users/nightly/gcc.svn/test-intel64corei7avx2/gcc-build-trunk/src-trunk/libstdc++-v3/libsupc++  -fPIC -DPIC -fno-implicit-templates  -Wall -Wextra -Wwrite-strings -Wcast-qual -Wabi  -fdiagnostics-show-location=once   -ffunction-sections -fdata-sections  -frandom-seed=compatibility-thread-c++0x.lo -g -O2 -D_GNU_SOURCE  -m32  -std=gnu++11 -c ../../../../../src-trunk/libstdc++-v3/src/c++11/compatibility-thread-c++0x.cc
libtool: compile:  /export/users/nightly/gcc.svn/test-intel64corei7avx2/gcc-build-trunk/bld/./gcc/xgcc -shared-libgcc -B/export/users/nightly/gcc.svn/test-intel64corei7avx2/gcc-build-trunk/bld/./gcc -nostdinc++ -L/export/users/nightly/gcc.svn/test-intel64corei7avx2/gcc-build-trunk/bld/x86_64-unknown-linux-gnu/32/libstdc++-v3/src -L/export/users/nightly/gcc.svn/test-intel64corei7avx2/gcc-build-trunk/bld/x86_64-unknown-linux-gnu/32/libstdc++-v3/src/.libs -L/export/users/nightly/gcc.svn/test-intel64corei7avx2/gcc-build-trunk/bld/x86_64-unknown-linux-gnu/32/libstdc++-v3/libsupc++/.libs -B/usr/local/x86_64-unknown-linux-gnu/bin/ -B/usr/local/x86_64-unknown-linux-gnu/lib/ -isystem /usr/local/x86_64-unknown-linux-gnu/include -isystem /usr/local/x86_64-unknown-linux-gnu/sys-include -m32 -I/export/users/nightly/gcc.svn/test-intel64corei7avx2/gcc-build-trunk/bld/x86_64-unknown-linux-gnu/32/libstdc++-v3/include/x86_64-unknown-linux-gnu -I/export/users/nightly/gcc.svn/test-intel64corei7avx2/gcc-build-trunk/bld/x86_64-unknown-linux-gnu/32/libstdc++-v3/include -I/export/users/nightly/gcc.svn/test-intel64corei7avx2/gcc-build-trunk/src-trunk/libstdc++-v3/libsupc++ -fPIC -DPIC -fno-implicit-templates -Wall -Wextra -Wwrite-strings -Wcast-qual -Wabi -fdiagnostics-show-location=once -ffunction-sections -fdata-sections -frandom-seed=compatibility-thread-c++0x.lo -g -O2 -D_GNU_SOURCE -m32 -std=gnu++11 -c ../../../../../src-trunk/libstdc++-v3/src/c++11/compatibility-thread-c++0x.cc  -fPIC -DPIC -D_GLIBCXX_SHARED -o .libs/compatibility-thread-c++0x.o
/bin/sh ../libtool --tag CXX   --mode=compile /export/users/nightly/gcc.svn/test-intel64corei7avx2/gcc-build-trunk/bld/./gcc/xgcc -shared-libgcc -B/export/users/nightly/gcc.svn/test-intel64corei7avx2/gcc-build-trunk/bld/./gcc -nostdinc++ -L/export/users/nightly/gcc.svn/test-intel64corei7avx2/gcc-build-trunk/bld/x86_64-unknown-linux-gnu/32/libstdc++-v3/src -L/export/users/nightly/gcc.svn/test-intel64corei7avx2/gcc-build-trunk/bld/x86_64-unknown-linux-gnu/32/libstdc++-v3/src/.libs -L/export/users/nightly/gcc.svn/test-intel64corei7avx2/gcc-build-trunk/bld/x86_64-unknown-linux-gnu/32/libstdc++-v3/libsupc++/.libs -B/usr/local/x86_64-unknown-linux-gnu/bin/ -B/usr/local/x86_64-unknown-linux-gnu/lib/ -isystem /usr/local/x86_64-unknown-linux-gnu/include -isystem /usr/local/x86_64-unknown-linux-gnu/sys-include  -m32  -I/export/users/nightly/gcc.svn/test-intel64corei7avx2/gcc-build-trunk/bld/x86_64-unknown-linux-gnu/32/libstdc++-v3/include/x86_64-unknown-linux-gnu -I/export/users/nightly/gcc.svn/test-intel64corei7avx2/gcc-build-trunk/bld/x86_64-unknown-linux-gnu/32/libstdc++-v3/include -I/export/users/nightly/gcc.svn/test-intel64corei7avx2/gcc-build-trunk/src-trunk/libstdc++-v3/libsupc++  -fPIC -DPIC -fno-implicit-templates  -Wall -Wextra -Wwrite-strings -Wcast-qual -Wabi  -fdiagnostics-show-location=once   -ffunction-sections -fdata-sections  -frandom-seed=compatibility-chrono.lo -g -O2 -D_GNU_SOURCE  -m32  -std=gnu++11 -c ../../../../../src-trunk/libstdc++-v3/src/c++11/compatibility-chrono.cc
libtool: compile:  /export/users/nightly/gcc.svn/test-intel64corei7avx2/gcc-build-trunk/bld/./gcc/xgcc -shared-libgcc -B/export/users/nightly/gcc.svn/test-intel64corei7avx2/gcc-build-trunk/bld/./gcc -nostdinc++ -L/export/users/nightly/gcc.svn/test-intel64corei7avx2/gcc-build-trunk/bld/x86_64-unknown-linux-gnu/32/libstdc++-v3/src -L/export/users/nightly/gcc.svn/test-intel64corei7avx2/gcc-build-trunk/bld/x86_64-unknown-linux-gnu/32/libstdc++-v3/src/.libs -L/export/users/nightly/gcc.svn/test-intel64corei7avx2/gcc-build-trunk/bld/x86_64-unknown-linux-gnu/32/libstdc++-v3/libsupc++/.libs -B/usr/local/x86_64-unknown-linux-gnu/bin/ -B/usr/local/x86_64-unknown-linux-gnu/lib/ -isystem /usr/local/x86_64-unknown-linux-gnu/include -isystem /usr/local/x86_64-unknown-linux-gnu/sys-include -m32 -I/export/users/nightly/gcc.svn/test-intel64corei7avx2/gcc-build-trunk/bld/x86_64-unknown-linux-gnu/32/libstdc++-v3/include/x86_64-unknown-linux-gnu -I/export/users/nightly/gcc.svn/test-intel64corei7avx2/gcc-build-trunk/bld/x86_64-unknown-linux-gnu/32/libstdc++-v3/include -I/export/users/nightly/gcc.svn/test-intel64corei7avx2/gcc-build-trunk/src-trunk/libstdc++-v3/libsupc++ -fPIC -DPIC -fno-implicit-templates -Wall -Wextra -Wwrite-strings -Wcast-qual -Wabi -fdiagnostics-show-location=once -ffunction-sections -fdata-sections -frandom-seed=compatibility-chrono.lo -g -O2 -D_GNU_SOURCE -m32 -std=gnu++11 -c ../../../../../src-trunk/libstdc++-v3/src/c++11/compatibility-chrono.cc  -fPIC -DPIC -D_GLIBCXX_SHARED -o .libs/compatibility-chrono.o
libtool: compile:  /export/users/nightly/gcc.svn/test-intel64corei7avx2/gcc-build-trunk/bld/./gcc/xgcc -shared-libgcc -B/export/users/nightly/gcc.svn/test-intel64corei7avx2/gcc-build-trunk/bld/./gcc -nostdinc++ -L/export/users/nightly/gcc.svn/test-intel64corei7avx2/gcc-build-trunk/bld/x86_64-unknown-linux-gnu/32/libstdc++-v3/src -L/export/users/nightly/gcc.svn/test-intel64corei7avx2/gcc-build-trunk/bld/x86_64-unknown-linux-gnu/32/libstdc++-v3/src/.libs -L/export/users/nightly/gcc.svn/test-intel64corei7avx2/gcc-build-trunk/bld/x86_64-unknown-linux-gnu/32/libstdc++-v3/libsupc++/.libs -B/usr/local/x86_64-unknown-linux-gnu/bin/ -B/usr/local/x86_64-unknown-linux-gnu/lib/ -isystem /usr/local/x86_64-unknown-linux-gnu/include -isystem /usr/local/x86_64-unknown-linux-gnu/sys-include -m32 -I/export/users/nightly/gcc.svn/test-intel64corei7avx2/gcc-build-trunk/bld/x86_64-unknown-linux-gnu/32/libstdc++-v3/include/x86_64-unknown-linux-gnu -I/export/users/nightly/gcc.svn/test-intel64corei7avx2/gcc-build-trunk/bld/x86_64-unknown-linux-gnu/32/libstdc++-v3/include -I/export/users/nightly/gcc.svn/test-intel64corei7avx2/gcc-build-trunk/src-trunk/libstdc++-v3/libsupc++ -fPIC -DPIC -fno-implicit-templates -Wall -Wextra -Wwrite-strings -Wcast-qual -Wabi -fdiagnostics-show-location=once -ffunction-sections -fdata-sections -frandom-seed=compatibility-chrono.lo -g -O2 -D_GNU_SOURCE -m32 -std=gnu++11 -c ../../../../../src-trunk/libstdc++-v3/src/c++11/compatibility-chrono.cc -o compatibility-chrono.o >/dev/null 2>&1
/bin/sh ../libtool --tag CXX   --mode=compile /export/users/nightly/gcc.svn/test-intel64corei7avx2/gcc-build-trunk/bld/./gcc/xgcc -shared-libgcc -B/export/users/nightly/gcc.svn/test-intel64corei7avx2/gcc-build-trunk/bld/./gcc -nostdinc++ -L/export/users/nightly/gcc.svn/test-intel64corei7avx2/gcc-build-trunk/bld/x86_64-unknown-linux-gnu/32/libstdc++-v3/src -L/export/users/nightly/gcc.svn/test-intel64corei7avx2/gcc-build-trunk/bld/x86_64-unknown-linux-gnu/32/libstdc++-v3/src/.libs -L/export/users/nightly/gcc.svn/test-intel64corei7avx2/gcc-build-trunk/bld/x86_64-unknown-linux-gnu/32/libstdc++-v3/libsupc++/.libs -B/usr/local/x86_64-unknown-linux-gnu/bin/ -B/usr/local/x86_64-unknown-linux-gnu/lib/ -isystem /usr/local/x86_64-unknown-linux-gnu/include -isystem /usr/local/x86_64-unknown-linux-gnu/sys-include  -m32  -I/export/users/nightly/gcc.svn/test-intel64corei7avx2/gcc-build-trunk/bld/x86_64-unknown-linux-gnu/32/libstdc++-v3/include/x86_64-unknown-linux-gnu -I/export/users/nightly/gcc.svn/test-intel64corei7avx2/gcc-build-trunk/bld/x86_64-unknown-linux-gnu/32/libstdc++-v3/include -I/export/users/nightly/gcc.svn/test-intel64corei7avx2/gcc-build-trunk/src-trunk/libstdc++-v3/libsupc++  -fPIC -DPIC -fno-implicit-templates  -Wall -Wextra -Wwrite-strings -Wcast-qual -Wabi  -fdiagnostics-show-location=once   -ffunction-sections -fdata-sections  -frandom-seed=compatibility-condvar.lo -g -O2 -D_GNU_SOURCE  -m32  -std=gnu++11 -c ../../../../../src-trunk/libstdc++-v3/src/c++11/compatibility-condvar.cc
libtool: compile:  /export/users/nightly/gcc.svn/test-intel64corei7avx2/gcc-build-trunk/bld/./gcc/xgcc -shared-libgcc -B/export/users/nightly/gcc.svn/test-intel64corei7avx2/gcc-build-trunk/bld/./gcc -nostdinc++ -L/export/users/nightly/gcc.svn/test-intel64corei7avx2/gcc-build-trunk/bld/x86_64-unknown-linux-gnu/32/libstdc++-v3/src -L/export/users/nightly/gcc.svn/test-intel64corei7avx2/gcc-build-trunk/bld/x86_64-unknown-linux-gnu/32/libstdc++-v3/src/.libs -L/export/users/nightly/gcc.svn/test-intel64corei7avx2/gcc-build-trunk/bld/x86_64-unknown-linux-gnu/32/libstdc++-v3/libsupc++/.libs -B/usr/local/x86_64-unknown-linux-gnu/bin/ -B/usr/local/x86_64-unknown-linux-gnu/lib/ -isystem /usr/local/x86_64-unknown-linux-gnu/include -isystem /usr/local/x86_64-unknown-linux-gnu/sys-include -m32 -I/export/users/nightly/gcc.svn/test-intel64corei7avx2/gcc-build-trunk/bld/x86_64-unknown-linux-gnu/32/libstdc++-v3/include/x86_64-unknown-linux-gnu -I/export/users/nightly/gcc.svn/test-intel64corei7avx2/gcc-build-trunk/bld/x86_64-unknown-linux-gnu/32/libstdc++-v3/include -I/export/users/nightly/gcc.svn/test-intel64corei7avx2/gcc-build-trunk/src-trunk/libstdc++-v3/libsupc++ -fPIC -DPIC -fno-implicit-templates -Wall -Wextra -Wwrite-strings -Wcast-qual -Wabi -fdiagnostics-show-location=once -ffunction-sections -fdata-sections -frandom-seed=compatibility-condvar.lo -g -O2 -D_GNU_SOURCE -m32 -std=gnu++11 -c ../../../../../src-trunk/libstdc++-v3/src/c++11/compatibility-condvar.cc  -fPIC -DPIC -D_GLIBCXX_SHARED -o .libs/compatibility-condvar.o
libtool: compile:  /export/users/nightly/gcc.svn/test-intel64corei7avx2/gcc-build-trunk/bld/./gcc/xgcc -shared-libgcc -B/export/users/nightly/gcc.svn/test-intel64corei7avx2/gcc-build-trunk/bld/./gcc -nostdinc++ -L/export/users/nightly/gcc.svn/test-intel64corei7avx2/gcc-build-trunk/bld/x86_64-unknown-linux-gnu/32/libstdc++-v3/src -L/export/users/nightly/gcc.svn/test-intel64corei7avx2/gcc-build-trunk/bld/x86_64-unknown-linux-gnu/32/libstdc++-v3/src/.libs -L/export/users/nightly/gcc.svn/test-intel64corei7avx2/gcc-build-trunk/bld/x86_64-unknown-linux-gnu/32/libstdc++-v3/libsupc++/.libs -B/usr/local/x86_64-unknown-linux-gnu/bin/ -B/usr/local/x86_64-unknown-linux-gnu/lib/ -isystem /usr/local/x86_64-unknown-linux-gnu/include -isystem /usr/local/x86_64-unknown-linux-gnu/sys-include -m32 -I/export/users/nightly/gcc.svn/test-intel64corei7avx2/gcc-build-trunk/bld/x86_64-unknown-linux-gnu/32/libstdc++-v3/include/x86_64-unknown-linux-gnu -I/export/users/nightly/gcc.svn/test-intel64corei7avx2/gcc-build-trunk/bld/x86_64-unknown-linux-gnu/32/libstdc++-v3/include -I/export/users/nightly/gcc.svn/test-intel64corei7avx2/gcc-build-trunk/src-trunk/libstdc++-v3/libsupc++ -fPIC -DPIC -fno-implicit-templates -Wall -Wextra -Wwrite-strings -Wcast-qual -Wabi -fdiagnostics-show-location=once -ffunction-sections -fdata-sections -frandom-seed=compatibility-condvar.lo -g -O2 -D_GNU_SOURCE -m32 -std=gnu++11 -c ../../../../../src-trunk/libstdc++-v3/src/c++11/compatibility-condvar.cc -o compatibility-condvar.o >/dev/null 2>&1
libtool: compile:  /export/users/nightly/gcc.svn/test-intel64corei7avx2/gcc-build-trunk/bld/./gcc/xgcc -shared-libgcc -B/export/users/nightly/gcc.svn/test-intel64corei7avx2/gcc-build-trunk/bld/./gcc -nostdinc++ -L/export/users/nightly/gcc.svn/test-intel64corei7avx2/gcc-build-trunk/bld/x86_64-unknown-linux-gnu/32/libstdc++-v3/src -L/export/users/nightly/gcc.svn/test-intel64corei7avx2/gcc-build-trunk/bld/x86_64-unknown-linux-gnu/32/libstdc++-v3/src/.libs -L/export/users/nightly/gcc.svn/test-intel64corei7avx2/gcc-build-trunk/bld/x86_64-unknown-linux-gnu/32/libstdc++-v3/libsupc++/.libs -B/usr/local/x86_64-unknown-linux-gnu/bin/ -B/usr/local/x86_64-unknown-linux-gnu/lib/ -isystem /usr/local/x86_64-unknown-linux-gnu/include -isystem /usr/local/x86_64-unknown-linux-gnu/sys-include -m32 -I/export/users/nightly/gcc.svn/test-intel64corei7avx2/gcc-build-trunk/bld/x86_64-unknown-linux-gnu/32/libstdc++-v3/include/x86_64-unknown-linux-gnu -I/export/users/nightly/gcc.svn/test-intel64corei7avx2/gcc-build-trunk/bld/x86_64-unknown-linux-gnu/32/libstdc++-v3/include -I/export/users/nightly/gcc.svn/test-intel64corei7avx2/gcc-build-trunk/src-trunk/libstdc++-v3/libsupc++ -fPIC -DPIC -fno-implicit-templates -Wall -Wextra -Wwrite-strings -Wcast-qual -Wabi -fdiagnostics-show-location=once -ffunction-sections -fdata-sections -frandom-seed=compatibility-thread-c++0x.lo -g -O2 -D_GNU_SOURCE -m32 -std=gnu++11 -c ../../../../../src-trunk/libstdc++-v3/src/c++11/compatibility-thread-c++0x.cc -o compatibility-thread-c++0x.o >/dev/null 2>&1
cp /export/users/nightly/gcc.svn/test-intel64corei7avx2/gcc-build-trunk/src-trunk/libstdc++-v3/config/abi/pre/gnu.ver libstdc++-symbols.ver.tmp
make[13]: *** No rule to make target `../src/c++98/libc++98convenience.la', needed by `libstdc++.la'.  Stop.
make[13]: *** Waiting for unfinished jobs....
chmod +w libstdc++-symbols.ver.tmp
if test "x" != x; then \
  if grep '^# Appended to version file.' \
        /dev/null > /dev/null 2>&1; then \
    cat  >> libstdc++-symbols.ver.tmp; \
  else \
    sed -n '1,/DO NOT DELETE/p' libstdc++-symbols.ver.tmp > tmp.top; \
    sed -n '/DO NOT DELETE/,$p' libstdc++-symbols.ver.tmp > tmp.bottom; \
    cat tmp.top  tmp.bottom > libstdc++-symbols.ver.tmp; \
    rm tmp.top tmp.bottom; \
  fi; \
fi
/usr/bin/grep -E -v '^[ 	]*#(#| |$)' libstdc++-symbols.ver.tmp | \
  /export/users/nightly/gcc.svn/test-intel64corei7avx2/gcc-build-trunk/bld/./gcc/xgcc -B/export/users/nightly/gcc.svn/test-intel64corei7avx2/gcc-build-trunk/bld/./gcc/ -B/usr/local/x86_64-unknown-linux-gnu/bin/ -B/usr/local/x86_64-unknown-linux-gnu/lib/ -isystem /usr/local/x86_64-unknown-linux-gnu/include -isystem /usr/local/x86_64-unknown-linux-gnu/sys-include  -m32 -E -P -include ../config.h - > libstdc++-symbols.ver || (rm -f libstdc++-symbols.ver ; exit 1)
rm -f libstdc++-symbols.ver.tmp
make[13]: Leaving directory `/export/users/nightly/gcc.svn/test-intel64corei7avx2/gcc-build-trunk/bld/x86_64-unknown-linux-gnu/32/libstdc++-v3/src'
make[12]: *** [all-recursive] Error 1
make[12]: Leaving directory `/export/users/nightly/gcc.svn/test-intel64corei7avx2/gcc-build-trunk/bld/x86_64-unknown-linux-gnu/32/libstdc++-v3/src'
make[11]: *** [all-recursive] Error 1
make[11]: Leaving directory `/export/users/nightly/gcc.svn/test-intel64corei7avx2/gcc-build-trunk/bld/x86_64-unknown-linux-gnu/32/libstdc++-v3'
make[10]: *** [all] Error 2
make[10]: Leaving directory `/export/users/nightly/gcc.svn/test-intel64corei7avx2/gcc-build-trunk/bld/x86_64-unknown-linux-gnu/32/libstdc++-v3'
make[9]: *** [multi-do] Error 1
make[9]: Leaving directory `/export/users/nightly/gcc.svn/test-intel64corei7avx2/gcc-build-trunk/bld/x86_64-unknown-linux-gnu/libstdc++-v3'
make[8]: *** [all-multi] Error 2
make[8]: Leaving directory `/export/users/nightly/gcc.svn/test-intel64corei7avx2/gcc-build-trunk/bld/x86_64-unknown-linux-gnu/libstdc++-v3'
make[7]: *** [all-recursive] Error 1
make[7]: Leaving directory `/export/users/nightly/gcc.svn/test-intel64corei7avx2/gcc-build-trunk/bld/x86_64-unknown-linux-gnu/libstdc++-v3'
make[6]: *** [all] Error 2
make[6]: Leaving directory `/export/users/nightly/gcc.svn/test-intel64corei7avx2/gcc-build-trunk/bld/x86_64-unknown-linux-gnu/libstdc++-v3'
make[5]: *** [all-stage1-target-libstdc++-v3] Error 2
make[5]: Leaving directory `/export/users/nightly/gcc.svn/test-intel64corei7avx2/gcc-build-trunk/bld'
make[4]: *** [stage1-bubble] Error 2
make[4]: Leaving directory `/export/users/nightly/gcc.svn/test-intel64corei7avx2/gcc-build-trunk/bld'
make[3]: *** [bootstrap] Error 2
make[3]: Leaving directory `/export/users/nightly/gcc.svn/test-intel64corei7avx2/gcc-build-trunk/bld'
877.05user 48.83system 8:40.73elapsed 177%CPU (0avgtext+0avgdata 650364maxresident)k
0inputs+4726144outputs (0major+44233059minor)pagefaults 0swaps
make[2]: *** [bootstrap] Error 2
make[2]: Leaving directory `/export/users/nightly/gcc.svn/test-intel64corei7avx2/gcc-build-trunk'



More information about the Gcc-regression mailing list