GCC build failure, HEAD@197074 on native

GCC regression tester regress@geoffk.org
Tue Mar 26 00:04:00 GMT 2013


With your recent patch, GCC HEAD revision 197074 had problems on:
native: build (about the same as the previous build)
Attached is build output for those targets.
The previous build was of revision 197072.

Log information for changes since the last build:
------------------------------------------------------------------------
r197073 | walt | 2013-03-25 16:50:52 -0700 (Mon, 25 Mar 2013) | 4 lines
Changed paths:
   M /trunk/gcc/ChangeLog
   M /trunk/gcc/config/tilegx/tilegx.c
   M /trunk/gcc/config/tilepro/tilepro.c

Switch eh data to always use pc relative/indirect encoding, to avoid
relocations of unaligned words.


------------------------------------------------------------------------
r197074 | walt | 2013-03-25 16:59:38 -0700 (Mon, 25 Mar 2013) | 4 lines
Changed paths:
   M /trunk/gcc/ChangeLog
   M /trunk/gcc/config/tilegx/tilegx.c

       * config/tilegx/tilegx.c (expand_set_cint64_one_inst): Inline
       tests for constraint J, K, N, P.


------------------------------------------------------------------------

For more information, see <http://glutton.geoffk.org/HEAD/>.

-------------- next part --------------
Please submit a full bug report,
with preprocessed source if appropriate.
Please include the complete backtrace with any bug report.
See <http://gcc.gnu.org/bugs.html> for instructions.
make[6]: *** [mt_allocator.lo] Error 1
make[6]: *** Waiting for unfinished jobs....
make[6]: Leaving directory `/home/regress/tbox/native/build/i686-pc-linux-gnu/libstdc++-v3/src/c++98'
make[5]: *** [all-recursive] Error 1
make[5]: Leaving directory `/home/regress/tbox/native/build/i686-pc-linux-gnu/libstdc++-v3/src'
make[4]: *** [all-recursive] Error 1
make[4]: Leaving directory `/home/regress/tbox/native/build/i686-pc-linux-gnu/libstdc++-v3'
make[3]: *** [all] Error 2
make[3]: Leaving directory `/home/regress/tbox/native/build/i686-pc-linux-gnu/libstdc++-v3'
make[2]: *** [all-stage1-target-libstdc++-v3] Error 2
make[2]: Leaving directory `/home/regress/tbox/native/build'
make[1]: *** [stage1-bubble] Error 2
make[1]: Leaving directory `/home/regress/tbox/native/build'
make: *** [bootstrap] Error 2
+ '[' -s .bad_compare ']'
+ exit 1
-------------- next part --------------

-- 
Geoffrey Keating <geoffk@geoffk.org> 
(via an automated GCC regression-testing script.)


More information about the Gcc-regression mailing list