Gcc [trunk revision 200003] failed to profiledbootstrap on x86_64!

H.J. Lu Intel64 LTO/FDO intel64profiled@gnu-mic-1.sc.intel.com
Wed Jun 12 14:26:00 GMT 2013


cd bld; \
 RUNTESTFLAGS="--target_board='unix{-m32,}'" ../src-trunk/configure \
	 --prefix=/usr/4.9.0 --enable-clocale=gnu --with-system-zlib --enable-shared --with-demangler-in-ld --with-build-config=bootstrap-lto --disable-werror --with-fpmath=sse --enable-languages=c,c++,fortran,java,lto,objc
checking build system type... x86_64-unknown-linux-gnu
checking host system type... x86_64-unknown-linux-gnu
checking target system type... x86_64-unknown-linux-gnu
checking for a BSD-compatible install... /bin/install -c
    grep "Error " makelog.200003.trunk.x86_64 >> makelog.200003.trunk.x86_64.mail; \
make[7]: *** [/tmp/cciSYLsO.ltrans0.ltrans.o] Error 1
make[6]: *** [build/genhooks] Error 1
make[7]: *** [/tmp/ccUL98B1.ltrans0.ltrans.o] Error 1
make[6]: *** [build/genenums] Error 1
make[5]: *** [all-stagefeedback-gcc] Error 2
make[4]: *** [stagefeedback-bubble] Error 2
make[3]: *** [profiledbootstrap] Error 2
make[2]: *** [profiledbootstrap] Error 2
  Called by: _ZL13emit_findicesPKcS0_/521 _ZL13emit_findicesPKcS0_/74 _ZL18emit_documentationPKc/78 (1.00 per call) _ZL18emit_documentationPKc/78 (1.00 per call) _ZL18emit_documentationPKc/78 (1.00 per call) _ZL18emit_documentationPKc/78 (1.00 per call) _ZL18emit_documentationPKc/78 (1.00 per call) _ZL18emit_documentationPKc/78 (1.00 per call) _ZL16emit_init_macrosPKc/79 
  Calls: exit/224 (1.00 per call) __overflow/101 (1.00 per call) __builtin_expect/222 (1.00 per call) __builtin_va_end/221 (1.00 per call) vfprintf/220 (1.00 per call) fprintf/219 (1.00 per call) __builtin_va_start/217 (1.00 per call) 
lto1: internal compiler error: verify_cgraph_node failed
0x6265ab verify_cgraph_node(cgraph_node*)
	../../src-trunk/gcc/cgraph.c:2600
0x61b5de verify_symtab_node
	../../src-trunk/gcc/symtab.c:749
0x61b5de verify_symtab()
	../../src-trunk/gcc/symtab.c:766
0x62e298 compile()
	../../src-trunk/gcc/cgraphunit.c:1924
0x54b43d lto_main()
	../../src-trunk/gcc/lto/lto.c:3355
Please submit a full bug report,
with preprocessed source if appropriate.
Please include the complete backtrace with any bug report.
See <http://gcc.gnu.org/bugs.html> for instructions.
make[7]: *** [/tmp/cciSYLsO.ltrans0.ltrans.o] Error 1
lto-wrapper: make returned 2 exit status
/usr/local/bin/ld: lto-wrapper failed
collect2: error: ld returned 1 exit status
make[6]: *** [build/genhooks] Error 1
make[6]: *** Waiting for unfinished jobs....
lto1: error: edge points to wrong declaration:
 <function_decl 0x7ffff7e53d00 __builtin_expect
    type <function_type 0x7ffff7deadc8
        type <integer_type 0x7ffff7dd7738 long int asm_written public DI
            size <integer_cst 0x7ffff7dc6d20 constant 64>
            unit size <integer_cst 0x7ffff7dc6d40 constant 8>
            align 64 symtab -135174272 alias set -1 canonical type 0x7ffff7dd7738 precision 64 min <integer_cst 0x7ffff7ddb100 -9223372036854775808> max <integer_cst 0x7ffff7ddb120 9223372036854775807>
            pointer_to_this <pointer_type 0x7ffff7de4f18>>
        QI
        size <integer_cst 0x7ffff7dc6ee0 constant 8>
        unit size <integer_cst 0x7ffff7dc6f00 constant 1>
        align 8 symtab 0 alias set -1 canonical type 0x7ffff7deadc8
        arg-types <tree_list 0x7ffff7de9528 value <integer_type 0x7ffff7dd7738 long int>
            chain <tree_list 0x7ffff7de9500 value <integer_type 0x7ffff7dd7738 long int>
                chain <tree_list 0x7ffff7dd16e0 value <void_type 0x7ffff7dd7bd0 void>>>>>
    readonly addressable nothrow public external built-in QI file <built-in> line 0 col 0
    align 8 built-in BUILT_IN_NORMAL:BUILT_IN_EXPECT attributes <tree_list 0x7ffff7e52780>>
 Instead of: <function_decl 0x7ffff7e53d00 __builtin_expect
    type <function_type 0x7ffff7deadc8
        type <integer_type 0x7ffff7dd7738 long int asm_written public DI
            size <integer_cst 0x7ffff7dc6d20 constant 64>
            unit size <integer_cst 0x7ffff7dc6d40 constant 8>
            align 64 symtab -135174272 alias set -1 canonical type 0x7ffff7dd7738 precision 64 min <integer_cst 0x7ffff7ddb100 -9223372036854775808> max <integer_cst 0x7ffff7ddb120 9223372036854775807>
            pointer_to_this <pointer_type 0x7ffff7de4f18>>
        QI
        size <integer_cst 0x7ffff7dc6ee0 constant 8>
        unit size <integer_cst 0x7ffff7dc6f00 constant 1>
        align 8 symtab 0 alias set -1 canonical type 0x7ffff7deadc8
        arg-types <tree_list 0x7ffff7de9528 value <integer_type 0x7ffff7dd7738 long int>
            chain <tree_list 0x7ffff7de9500 value <integer_type 0x7ffff7dd7738 long int>
                chain <tree_list 0x7ffff7dd16e0 value <void_type 0x7ffff7dd7bd0 void>>>>>
    readonly addressable nothrow public external built-in QI file <built-in> line 0 col 0
    align 8 built-in BUILT_IN_NORMAL:BUILT_IN_EXPECT attributes <tree_list 0x7ffff7e52780>>
_ZL15print_enum_typePPvS_.lto_priv.15/75 (print_enum_type) @0x7ffff7f62d10
  Type: function definition analyzed
  Visibility: used_from_other_partition prevailing_def_ironly public visibility_specified visibility:hidden
  Address is taken.
  References: stdout/81 (read)
  Referring: 
  Read from file: /tmp/ccUL98B1.ltrans0.o
  Availability: available
  Function flags: executed 29902x body
  Called by: 
  Calls: puts/85 (29902x) (1.00 per call) __overflow/87 __builtin_expect/86 (2780886x) (93.23 per call) printf/84 (2810788x) (94.24 per call) printf/84 (29902x) (1.00 per call) 
lto1: internal compiler error: verify_cgraph_node failed
0x6265ab verify_cgraph_node(cgraph_node*)
	../../src-trunk/gcc/cgraph.c:2600
0x61b5de verify_symtab_node
	../../src-trunk/gcc/symtab.c:749
0x61b5de verify_symtab()
	../../src-trunk/gcc/symtab.c:766
0x62e298 compile()
	../../src-trunk/gcc/cgraphunit.c:1924
0x54b43d lto_main()
	../../src-trunk/gcc/lto/lto.c:3355
Please submit a full bug report,
with preprocessed source if appropriate.
Please include the complete backtrace with any bug report.
See <http://gcc.gnu.org/bugs.html> for instructions.
make[7]: *** [/tmp/ccUL98B1.ltrans0.ltrans.o] Error 1
make[7]: *** Waiting for unfinished jobs....
lto-wrapper: make returned 2 exit status
/usr/local/bin/ld: lto-wrapper failed
collect2: error: ld returned 1 exit status
make[6]: *** [build/genenums] Error 1
rm gcj-dbtool.pod jcf-dump.pod jv-convert.pod grmic.pod gcov.pod gcj.pod gc-analyze.pod gfdl.pod cpp.pod fsf-funding.pod gij.pod gfortran.pod gcc.pod
make[6]: Leaving directory `/export/gnu/import/git/gcc-test-profiled/bld/gcc'
make[5]: *** [all-stagefeedback-gcc] Error 2
make[5]: Leaving directory `/export/gnu/import/git/gcc-test-profiled/bld'
make[4]: *** [stagefeedback-bubble] Error 2
make[4]: Leaving directory `/export/gnu/import/git/gcc-test-profiled/bld'
make[3]: *** [profiledbootstrap] Error 2
make[3]: Leaving directory `/export/gnu/import/git/gcc-test-profiled/bld'
9284.76user 202.81system 31:40.90elapsed 499%CPU (0avgtext+0avgdata 551884maxresident)k
182248inputs+12312200outputs (8090major+117569631minor)pagefaults 0swaps
make[2]: *** [profiledbootstrap] Error 2
make[2]: Leaving directory `/export/gnu/import/git/gcc-test-profiled'



More information about the Gcc-regression mailing list