Gcc [trunk revision 201370] failed to profiledbootstrap on x86_64!

H.J. Lu Intel64 LTO/FDO intel64profiled@gnu-mic-1.sc.intel.com
Wed Jul 31 14:25:00 GMT 2013


cd bld; \
 RUNTESTFLAGS="--target_board='unix{-m32,}'" ../src-trunk/configure \
	 --prefix=/usr/4.9.0 --enable-clocale=gnu --with-system-zlib --enable-shared --with-demangler-in-ld --with-build-config=bootstrap-lto --disable-werror --with-fpmath=sse --enable-languages=c,c++,fortran,java,lto,objc
checking build system type... x86_64-unknown-linux-gnu
checking host system type... x86_64-unknown-linux-gnu
checking target system type... x86_64-unknown-linux-gnu
checking for a BSD-compatible install... /bin/install -c
    grep "Error " makelog.201370.trunk.x86_64 >> makelog.201370.trunk.x86_64.mail; \
make[6]: *** [build/genmodes.o] Error 1
make[5]: *** [all-stagefeedback-gcc] Error 2
make[4]: *** [stagefeedback-bubble] Error 2
make[3]: *** [profiledbootstrap] Error 2
make[2]: *** [profiledbootstrap] Error 2
 }
 ^
echo timestamp > doc/cpp.1
(pod2man --center="GNU" --release="gcc-4.9.0" --date=2013-07-31 --section=1 cpp.pod > doc/cpp.1.T$$ && \
	mv -f doc/cpp.1.T$$ doc/cpp.1) || \
	(rm -f doc/cpp.1.T$$ && exit 1)
../../src-trunk/gcc/gengtype-state.c: In function 'read_state_nested_option(options*) [clone .isra.3]':
../../src-trunk/gcc/gengtype-state.c:2752:1: note: file /export/gnu/import/git/gcc-test-profiled/bld/gcc/gengtype-state.gcda not found, execution counts estimated
 }
 ^
echo timestamp > gcc.pod
perl ../../src-trunk/gcc/../contrib/texi2pod.pl ../../src-trunk/gcc/doc/invoke.texi > gcc.pod
echo timestamp > doc/gfdl.7
(pod2man --center="GNU" --release="gcc-4.9.0" --date=2013-07-31 --section=7 gfdl.pod > doc/gfdl.7.T$$ && \
	mv -f doc/gfdl.7.T$$ doc/gfdl.7) || \
	(rm -f doc/gfdl.7.T$$ && exit 1)
echo timestamp > doc/gpl.7
(pod2man --center="GNU" --release="gcc-4.9.0" --date=2013-07-31 --section=7 gpl.pod > doc/gpl.7.T$$ && \
	mv -f doc/gpl.7.T$$ doc/gpl.7) || \
	(rm -f doc/gpl.7.T$$ && exit 1)
echo timestamp > doc/fsf-funding.7
(pod2man --center="GNU" --release="gcc-4.9.0" --date=2013-07-31 --section=7 fsf-funding.pod > doc/fsf-funding.7.T$$ && \
	mv -f doc/fsf-funding.7.T$$ doc/fsf-funding.7) || \
	(rm -f doc/fsf-funding.7.T$$ && exit 1)
perl ../../src-trunk/gcc/../contrib/texi2pod.pl -DBUGURL="@uref{http://gcc.gnu.org/bugs.html}" \
  < ../../src-trunk/gcc/fortran/invoke.texi > gfortran.pod
echo timestamp > doc/gcj.1
(pod2man --center="GNU" --release="gcc-4.9.0" --date=2013-07-31 --section=1 gcj.pod > doc/gcj.1.T$$ && \
	mv -f doc/gcj.1.T$$ doc/gcj.1) || \
	(rm -f doc/gcj.1.T$$ && exit 1)
echo timestamp > doc/jcf-dump.1
(pod2man --center="GNU" --release="gcc-4.9.0" --date=2013-07-31 --section=1 jcf-dump.pod > doc/jcf-dump.1.T$$ && \
	mv -f doc/jcf-dump.1.T$$ doc/jcf-dump.1) || \
	(rm -f doc/jcf-dump.1.T$$ && exit 1)
echo timestamp > doc/gij.1
(pod2man --center="GNU" --release="gcc-4.9.0" --date=2013-07-31 --section=1 gij.pod > doc/gij.1.T$$ && \
	mv -f doc/gij.1.T$$ doc/gij.1) || \
	(rm -f doc/gij.1.T$$ && exit 1)
echo timestamp > doc/jv-convert.1
(pod2man --center="GNU" --release="gcc-4.9.0" --date=2013-07-31 --section=1 jv-convert.pod > doc/jv-convert.1.T$$ && \
	mv -f doc/jv-convert.1.T$$ doc/jv-convert.1) || \
	(rm -f doc/jv-convert.1.T$$ && exit 1)
echo timestamp > doc/grmic.1
(pod2man --center="GNU" --release="gcc-4.9.0" --date=2013-07-31 --section=1 grmic.pod > doc/grmic.1.T$$ && \
	mv -f doc/grmic.1.T$$ doc/grmic.1) || \
	(rm -f doc/grmic.1.T$$ && exit 1)
echo timestamp > doc/gcj-dbtool.1
(pod2man --center="GNU" --release="gcc-4.9.0" --date=2013-07-31 --section=1 gcj-dbtool.pod > doc/gcj-dbtool.1.T$$ && \
	mv -f doc/gcj-dbtool.1.T$$ doc/gcj-dbtool.1) || \
	(rm -f doc/gcj-dbtool.1.T$$ && exit 1)
echo timestamp > doc/gc-analyze.1
(pod2man --center="GNU" --release="gcc-4.9.0" --date=2013-07-31 --section=1 gc-analyze.pod > doc/gc-analyze.1.T$$ && \
	mv -f doc/gc-analyze.1.T$$ doc/gc-analyze.1) || \
	(rm -f doc/gc-analyze.1.T$$ && exit 1)
echo timestamp > doc/aot-compile.1
(pod2man --center="GNU" --release="gcc-4.9.0" --date=2013-07-31 --section=1 aot-compile.pod > doc/aot-compile.1.T$$ && \
	mv -f doc/aot-compile.1.T$$ doc/aot-compile.1) || \
	(rm -f doc/aot-compile.1.T$$ && exit 1)
echo timestamp > doc/rebuild-gcj-db.1
(pod2man --center="GNU" --release="gcc-4.9.0" --date=2013-07-31 --section=1 rebuild-gcj-db.pod > doc/rebuild-gcj-db.1.T$$ && \
	mv -f doc/rebuild-gcj-db.1.T$$ doc/rebuild-gcj-db.1) || \
	(rm -f doc/rebuild-gcj-db.1.T$$ && exit 1)
/export/gnu/import/git/gcc-test-profiled/bld/./prev-gcc/xg++ -B/export/gnu/import/git/gcc-test-profiled/bld/./prev-gcc/ -B/usr/4.9.0/x86_64-unknown-linux-gnu/bin/ -nostdinc++ -B/export/gnu/import/git/gcc-test-profiled/bld/prev-x86_64-unknown-linux-gnu/libstdc++-v3/src/.libs -B/export/gnu/import/git/gcc-test-profiled/bld/prev-x86_64-unknown-linux-gnu/libstdc++-v3/libsupc++/.libs -I/export/gnu/import/git/gcc-test-profiled/bld/prev-x86_64-unknown-linux-gnu/libstdc++-v3/include/x86_64-unknown-linux-gnu -I/export/gnu/import/git/gcc-test-profiled/bld/prev-x86_64-unknown-linux-gnu/libstdc++-v3/include -I/export/gnu/import/git/gcc-test-profiled/src-trunk/libstdc++-v3/libsupc++ -L/export/gnu/import/git/gcc-test-profiled/bld/prev-x86_64-unknown-linux-gnu/libstdc++-v3/src/.libs -L/export/gnu/import/git/gcc-test-profiled/bld/prev-x86_64-unknown-linux-gnu/libstdc++-v3/libsupc++/.libs -c   -g -O2 -flto=jobserver -frandom-seed=1 -fprofile-use -DIN_GCC   -fno-exceptions -fno-rtti -fasynchronous-unwind-tables -W -Wall -Wno-narrowing -Wwrite-strings -Wcast-qual -Wmissing-format-attribute -pedantic -Wno-long-long -Wno-variadic-macros -Wno-overlength-strings -fno-common  -DHAVE_CONFIG_H -DGENERATOR_FILE -I. -Ibuild -I../../src-trunk/gcc -I../../src-trunk/gcc/build -I../../src-trunk/gcc/../include -I../../src-trunk/gcc/../libcpp/include  -I../../src-trunk/gcc/../libdecnumber -I../../src-trunk/gcc/../libdecnumber/bid -I../libdecnumber -I../../src-trunk/gcc/../libbacktrace    \
	-o build/genconstants.o ../../src-trunk/gcc/genconstants.c
/export/gnu/import/git/gcc-test-profiled/bld/./prev-gcc/xg++ -B/export/gnu/import/git/gcc-test-profiled/bld/./prev-gcc/ -B/usr/4.9.0/x86_64-unknown-linux-gnu/bin/ -nostdinc++ -B/export/gnu/import/git/gcc-test-profiled/bld/prev-x86_64-unknown-linux-gnu/libstdc++-v3/src/.libs -B/export/gnu/import/git/gcc-test-profiled/bld/prev-x86_64-unknown-linux-gnu/libstdc++-v3/libsupc++/.libs -I/export/gnu/import/git/gcc-test-profiled/bld/prev-x86_64-unknown-linux-gnu/libstdc++-v3/include/x86_64-unknown-linux-gnu -I/export/gnu/import/git/gcc-test-profiled/bld/prev-x86_64-unknown-linux-gnu/libstdc++-v3/include -I/export/gnu/import/git/gcc-test-profiled/src-trunk/libstdc++-v3/libsupc++ -L/export/gnu/import/git/gcc-test-profiled/bld/prev-x86_64-unknown-linux-gnu/libstdc++-v3/src/.libs -L/export/gnu/import/git/gcc-test-profiled/bld/prev-x86_64-unknown-linux-gnu/libstdc++-v3/libsupc++/.libs -c   -g -O2 -flto=jobserver -frandom-seed=1 -fprofile-use -DIN_GCC   -fno-exceptions -fno-rtti -fasynchronous-unwind-tables -W -Wall -Wno-narrowing -Wwrite-strings -Wcast-qual -Wmissing-format-attribute -pedantic -Wno-long-long -Wno-variadic-macros -Wno-overlength-strings -fno-common  -DHAVE_CONFIG_H -DGENERATOR_FILE -I. -Ibuild -I../../src-trunk/gcc -I../../src-trunk/gcc/build -I../../src-trunk/gcc/../include -I../../src-trunk/gcc/../libcpp/include  -I../../src-trunk/gcc/../libdecnumber -I../../src-trunk/gcc/../libdecnumber/bid -I../libdecnumber -I../../src-trunk/gcc/../libbacktrace    \
	-o build/read-md.o ../../src-trunk/gcc/read-md.c
/export/gnu/import/git/gcc-test-profiled/bld/./prev-gcc/xg++ -B/export/gnu/import/git/gcc-test-profiled/bld/./prev-gcc/ -B/usr/4.9.0/x86_64-unknown-linux-gnu/bin/ -nostdinc++ -B/export/gnu/import/git/gcc-test-profiled/bld/prev-x86_64-unknown-linux-gnu/libstdc++-v3/src/.libs -B/export/gnu/import/git/gcc-test-profiled/bld/prev-x86_64-unknown-linux-gnu/libstdc++-v3/libsupc++/.libs -I/export/gnu/import/git/gcc-test-profiled/bld/prev-x86_64-unknown-linux-gnu/libstdc++-v3/include/x86_64-unknown-linux-gnu -I/export/gnu/import/git/gcc-test-profiled/bld/prev-x86_64-unknown-linux-gnu/libstdc++-v3/include -I/export/gnu/import/git/gcc-test-profiled/src-trunk/libstdc++-v3/libsupc++ -L/export/gnu/import/git/gcc-test-profiled/bld/prev-x86_64-unknown-linux-gnu/libstdc++-v3/src/.libs -L/export/gnu/import/git/gcc-test-profiled/bld/prev-x86_64-unknown-linux-gnu/libstdc++-v3/libsupc++/.libs -c   -g -O2 -flto=jobserver -frandom-seed=1 -fprofile-use -DIN_GCC   -fno-exceptions -fno-rtti -fasynchronous-unwind-tables -W -Wall -Wno-narrowing -Wwrite-strings -Wcast-qual -Wmissing-format-attribute -pedantic -Wno-long-long -Wno-variadic-macros -Wno-overlength-strings -fno-common  -DHAVE_CONFIG_H -DGENERATOR_FILE -I. -Ibuild -I../../src-trunk/gcc -I../../src-trunk/gcc/build -I../../src-trunk/gcc/../include -I../../src-trunk/gcc/../libcpp/include  -I../../src-trunk/gcc/../libdecnumber -I../../src-trunk/gcc/../libdecnumber/bid -I../libdecnumber -I../../src-trunk/gcc/../libbacktrace    \
	-o build/errors.o ../../src-trunk/gcc/errors.c
/export/gnu/import/git/gcc-test-profiled/bld/./prev-gcc/xg++ -B/export/gnu/import/git/gcc-test-profiled/bld/./prev-gcc/ -B/usr/4.9.0/x86_64-unknown-linux-gnu/bin/ -nostdinc++ -B/export/gnu/import/git/gcc-test-profiled/bld/prev-x86_64-unknown-linux-gnu/libstdc++-v3/src/.libs -B/export/gnu/import/git/gcc-test-profiled/bld/prev-x86_64-unknown-linux-gnu/libstdc++-v3/libsupc++/.libs -I/export/gnu/import/git/gcc-test-profiled/bld/prev-x86_64-unknown-linux-gnu/libstdc++-v3/include/x86_64-unknown-linux-gnu -I/export/gnu/import/git/gcc-test-profiled/bld/prev-x86_64-unknown-linux-gnu/libstdc++-v3/include -I/export/gnu/import/git/gcc-test-profiled/src-trunk/libstdc++-v3/libsupc++ -L/export/gnu/import/git/gcc-test-profiled/bld/prev-x86_64-unknown-linux-gnu/libstdc++-v3/src/.libs -L/export/gnu/import/git/gcc-test-profiled/bld/prev-x86_64-unknown-linux-gnu/libstdc++-v3/libsupc++/.libs -c   -g -O2 -flto=jobserver -frandom-seed=1 -fprofile-use -DIN_GCC   -fno-exceptions -fno-rtti -fasynchronous-unwind-tables -W -Wall -Wno-narrowing -Wwrite-strings -Wcast-qual -Wmissing-format-attribute -pedantic -Wno-long-long -Wno-variadic-macros -Wno-overlength-strings -fno-common  -DHAVE_CONFIG_H -DGENERATOR_FILE -I. -Ibuild -I../../src-trunk/gcc -I../../src-trunk/gcc/build -I../../src-trunk/gcc/../include -I../../src-trunk/gcc/../libcpp/include  -I../../src-trunk/gcc/../libdecnumber -I../../src-trunk/gcc/../libdecnumber/bid -I../libdecnumber -I../../src-trunk/gcc/../libbacktrace    \
	-o build/genmddeps.o ../../src-trunk/gcc/genmddeps.c
/export/gnu/import/git/gcc-test-profiled/bld/./prev-gcc/xg++ -B/export/gnu/import/git/gcc-test-profiled/bld/./prev-gcc/ -B/usr/4.9.0/x86_64-unknown-linux-gnu/bin/ -nostdinc++ -B/export/gnu/import/git/gcc-test-profiled/bld/prev-x86_64-unknown-linux-gnu/libstdc++-v3/src/.libs -B/export/gnu/import/git/gcc-test-profiled/bld/prev-x86_64-unknown-linux-gnu/libstdc++-v3/libsupc++/.libs -I/export/gnu/import/git/gcc-test-profiled/bld/prev-x86_64-unknown-linux-gnu/libstdc++-v3/include/x86_64-unknown-linux-gnu -I/export/gnu/import/git/gcc-test-profiled/bld/prev-x86_64-unknown-linux-gnu/libstdc++-v3/include -I/export/gnu/import/git/gcc-test-profiled/src-trunk/libstdc++-v3/libsupc++ -L/export/gnu/import/git/gcc-test-profiled/bld/prev-x86_64-unknown-linux-gnu/libstdc++-v3/src/.libs -L/export/gnu/import/git/gcc-test-profiled/bld/prev-x86_64-unknown-linux-gnu/libstdc++-v3/libsupc++/.libs -c   -g -O2 -flto=jobserver -frandom-seed=1 -fprofile-use -DIN_GCC   -fno-exceptions -fno-rtti -fasynchronous-unwind-tables -W -Wall -Wno-narrowing -Wwrite-strings -Wcast-qual -Wmissing-format-attribute -pedantic -Wno-long-long -Wno-variadic-macros -Wno-overlength-strings -fno-common  -DHAVE_CONFIG_H -DGENERATOR_FILE -I. -Ibuild -I../../src-trunk/gcc -I../../src-trunk/gcc/build -I../../src-trunk/gcc/../include -I../../src-trunk/gcc/../libcpp/include  -I../../src-trunk/gcc/../libdecnumber -I../../src-trunk/gcc/../libdecnumber/bid -I../libdecnumber -I../../src-trunk/gcc/../libbacktrace    \
	-o build/genmodes.o ../../src-trunk/gcc/genmodes.c
/export/gnu/import/git/gcc-test-profiled/bld/./prev-gcc/xg++ -B/export/gnu/import/git/gcc-test-profiled/bld/./prev-gcc/ -B/usr/4.9.0/x86_64-unknown-linux-gnu/bin/ -nostdinc++ -B/export/gnu/import/git/gcc-test-profiled/bld/prev-x86_64-unknown-linux-gnu/libstdc++-v3/src/.libs -B/export/gnu/import/git/gcc-test-profiled/bld/prev-x86_64-unknown-linux-gnu/libstdc++-v3/libsupc++/.libs -I/export/gnu/import/git/gcc-test-profiled/bld/prev-x86_64-unknown-linux-gnu/libstdc++-v3/include/x86_64-unknown-linux-gnu -I/export/gnu/import/git/gcc-test-profiled/bld/prev-x86_64-unknown-linux-gnu/libstdc++-v3/include -I/export/gnu/import/git/gcc-test-profiled/src-trunk/libstdc++-v3/libsupc++ -L/export/gnu/import/git/gcc-test-profiled/bld/prev-x86_64-unknown-linux-gnu/libstdc++-v3/src/.libs -L/export/gnu/import/git/gcc-test-profiled/bld/prev-x86_64-unknown-linux-gnu/libstdc++-v3/libsupc++/.libs -c   -g -O2 -flto=jobserver -frandom-seed=1 -fprofile-use -DIN_GCC   -fno-exceptions -fno-rtti -fasynchronous-unwind-tables -W -Wall -Wno-narrowing -Wwrite-strings -Wcast-qual -Wmissing-format-attribute -pedantic -Wno-long-long -Wno-variadic-macros -Wno-overlength-strings -fno-common  -DHAVE_CONFIG_H -DGENERATOR_FILE -I. -Ibuild -I../../src-trunk/gcc -I../../src-trunk/gcc/build -I../../src-trunk/gcc/../include -I../../src-trunk/gcc/../libcpp/include  -I../../src-trunk/gcc/../libdecnumber -I../../src-trunk/gcc/../libdecnumber/bid -I../libdecnumber -I../../src-trunk/gcc/../libbacktrace    \
	-o build/gengtype.o ../../src-trunk/gcc/gengtype.c
/export/gnu/import/git/gcc-test-profiled/bld/./prev-gcc/xg++ -B/export/gnu/import/git/gcc-test-profiled/bld/./prev-gcc/ -B/usr/4.9.0/x86_64-unknown-linux-gnu/bin/ -nostdinc++ -B/export/gnu/import/git/gcc-test-profiled/bld/prev-x86_64-unknown-linux-gnu/libstdc++-v3/src/.libs -B/export/gnu/import/git/gcc-test-profiled/bld/prev-x86_64-unknown-linux-gnu/libstdc++-v3/libsupc++/.libs -I/export/gnu/import/git/gcc-test-profiled/bld/prev-x86_64-unknown-linux-gnu/libstdc++-v3/include/x86_64-unknown-linux-gnu -I/export/gnu/import/git/gcc-test-profiled/bld/prev-x86_64-unknown-linux-gnu/libstdc++-v3/include -I/export/gnu/import/git/gcc-test-profiled/src-trunk/libstdc++-v3/libsupc++ -L/export/gnu/import/git/gcc-test-profiled/bld/prev-x86_64-unknown-linux-gnu/libstdc++-v3/src/.libs -L/export/gnu/import/git/gcc-test-profiled/bld/prev-x86_64-unknown-linux-gnu/libstdc++-v3/libsupc++/.libs -c   -g -O2 -flto=jobserver -frandom-seed=1 -fprofile-use -DIN_GCC   -fno-exceptions -fno-rtti -fasynchronous-unwind-tables -W -Wall -Wno-narrowing -Wwrite-strings -Wcast-qual -Wmissing-format-attribute -pedantic -Wno-long-long -Wno-variadic-macros -Wno-overlength-strings -fno-common -Wno-error -DHAVE_CONFIG_H -DGENERATOR_FILE -I. -Ibuild -I../../src-trunk/gcc -I../../src-trunk/gcc/build -I../../src-trunk/gcc/../include -I../../src-trunk/gcc/../libcpp/include  -I../../src-trunk/gcc/../libdecnumber -I../../src-trunk/gcc/../libdecnumber/bid -I../libdecnumber -I../../src-trunk/gcc/../libbacktrace    \
	-o build/gengtype-lex.o gengtype-lex.c
gengtype-lex.c: In function 'yy_buffer_state* yy_scan_bytes(const char*, yy_size_t)':
gengtype-lex.c:2652:17: warning: comparison between signed and unsigned integer expressions [-Wsign-compare]
 
                 ^
/export/gnu/import/git/gcc-test-profiled/bld/./prev-gcc/xg++ -B/export/gnu/import/git/gcc-test-profiled/bld/./prev-gcc/ -B/usr/4.9.0/x86_64-unknown-linux-gnu/bin/ -nostdinc++ -B/export/gnu/import/git/gcc-test-profiled/bld/prev-x86_64-unknown-linux-gnu/libstdc++-v3/src/.libs -B/export/gnu/import/git/gcc-test-profiled/bld/prev-x86_64-unknown-linux-gnu/libstdc++-v3/libsupc++/.libs -I/export/gnu/import/git/gcc-test-profiled/bld/prev-x86_64-unknown-linux-gnu/libstdc++-v3/include/x86_64-unknown-linux-gnu -I/export/gnu/import/git/gcc-test-profiled/bld/prev-x86_64-unknown-linux-gnu/libstdc++-v3/include -I/export/gnu/import/git/gcc-test-profiled/src-trunk/libstdc++-v3/libsupc++ -L/export/gnu/import/git/gcc-test-profiled/bld/prev-x86_64-unknown-linux-gnu/libstdc++-v3/src/.libs -L/export/gnu/import/git/gcc-test-profiled/bld/prev-x86_64-unknown-linux-gnu/libstdc++-v3/libsupc++/.libs -c   -g -O2 -flto=jobserver -frandom-seed=1 -fprofile-use -DIN_GCC   -fno-exceptions -fno-rtti -fasynchronous-unwind-tables -W -Wall -Wno-narrowing -Wwrite-strings -Wcast-qual -Wmissing-format-attribute -pedantic -Wno-long-long -Wno-variadic-macros -Wno-overlength-strings -fno-common  -DHAVE_CONFIG_H -DGENERATOR_FILE -I. -Ibuild -I../../src-trunk/gcc -I../../src-trunk/gcc/build -I../../src-trunk/gcc/../include -I../../src-trunk/gcc/../libcpp/include  -I../../src-trunk/gcc/../libdecnumber -I../../src-trunk/gcc/../libdecnumber/bid -I../libdecnumber -I../../src-trunk/gcc/../libbacktrace    \
	-o build/gengtype-parse.o ../../src-trunk/gcc/gengtype-parse.c
../../src-trunk/gcc/genmodes.c: In function 'make_vector_modes(mode_class, unsigned int, char const*, unsigned int)':
../../src-trunk/gcc/genmodes.c:499:17: error: corrupted value profile: interval profile counter (0 out of 0) inconsistent with basic-block count (105)
       if (width % m->bytesize)
                 ^
make[6]: *** [build/genmodes.o] Error 1
make[6]: *** Waiting for unfinished jobs....
rm gcj-dbtool.pod jcf-dump.pod gcj.pod jv-convert.pod grmic.pod gcov.pod gc-analyze.pod gfdl.pod cpp.pod fsf-funding.pod gij.pod gfortran.pod gcc.pod
make[6]: Leaving directory `/export/gnu/import/git/gcc-test-profiled/bld/gcc'
make[5]: *** [all-stagefeedback-gcc] Error 2
make[5]: Leaving directory `/export/gnu/import/git/gcc-test-profiled/bld'
make[4]: *** [stagefeedback-bubble] Error 2
make[4]: Leaving directory `/export/gnu/import/git/gcc-test-profiled/bld'
make[3]: *** [profiledbootstrap] Error 2
make[3]: Leaving directory `/export/gnu/import/git/gcc-test-profiled/bld'
9197.10user 201.37system 29:54.71elapsed 523%CPU (0avgtext+0avgdata 551872maxresident)k
492680inputs+12408960outputs (8793major+116359747minor)pagefaults 0swaps
make[2]: *** [profiledbootstrap] Error 2
make[2]: Leaving directory `/export/gnu/import/git/gcc-test-profiled'



More information about the Gcc-regression mailing list