GCC build failure, HEAD@201344 on native

GCC regression tester regress@geoffk.org
Tue Jul 30 16:55:00 GMT 2013


With your recent patch, GCC HEAD revision 201344 had problems on:
native: build (about the same as the previous build)
Attached is build output for those targets.
The previous build was of revision 201342.

Log information for changes since the last build:
------------------------------------------------------------------------
r201344 | paolo | 2013-07-30 09:48:52 -0700 (Tue, 30 Jul 2013) | 12 lines
Changed paths:
   M /trunk/gcc/cp/ChangeLog
   M /trunk/gcc/cp/call.c
   M /trunk/gcc/testsuite/ChangeLog
   A /trunk/gcc/testsuite/g++.dg/parse/crash63.C

/cp
2013-07-30  Paolo Carlini  <paolo.carlini@oracle.com>

	PR c++/57947
	* call.c (is_std_init_list): Return false if cxx_dialect == cxx98.

/testsuite
2013-07-30  Paolo Carlini  <paolo.carlini@oracle.com>

	PR c++/57947
	* g++.dg/parse/crash63.C: New.

------------------------------------------------------------------------

For more information, see <http://glutton.geoffk.org/HEAD/>.

-------------- next part --------------
../src/c++11/.libs/libc++11convenience.a(functexcept.o):/home/regress/tbox/native/build/i686-pc-linux-gnu/libstdc++-v3/include/bits/regex_grep_matcher.h:260: first defined here
../src/c++11/.libs/libc++11convenience.a(regex.o): In function `std::__detail::_BFSMatcher::_M_includes_some() const':
/home/regress/tbox/native/build/i686-pc-linux-gnu/libstdc++-v3/include/bits/regex_grep_matcher.tcc:194: multiple definition of `std::__detail::_BFSMatcher::_M_includes_some() const'
../src/c++11/.libs/libc++11convenience.a(functexcept.o):/home/regress/tbox/native/build/i686-pc-linux-gnu/libstdc++-v3/include/bits/regex_grep_matcher.tcc:194: first defined here
collect2: error: ld returned 1 exit status
make[6]: *** [libstdc++.la] Error 1
make[6]: Leaving directory `/home/regress/tbox/native/build/i686-pc-linux-gnu/libstdc++-v3/src'
make[5]: *** [all-recursive] Error 1
make[5]: Leaving directory `/home/regress/tbox/native/build/i686-pc-linux-gnu/libstdc++-v3/src'
make[4]: *** [all-recursive] Error 1
make[4]: Leaving directory `/home/regress/tbox/native/build/i686-pc-linux-gnu/libstdc++-v3'
make[3]: *** [all] Error 2
make[3]: Leaving directory `/home/regress/tbox/native/build/i686-pc-linux-gnu/libstdc++-v3'
make[2]: *** [all-stage1-target-libstdc++-v3] Error 2
make[2]: Leaving directory `/home/regress/tbox/native/build'
make[1]: *** [stage1-bubble] Error 2
make[1]: Leaving directory `/home/regress/tbox/native/build'
make: *** [bootstrap] Error 2
+ '[' -s .bad_compare ']'
+ exit 1
-------------- next part --------------

-- 
Geoffrey Keating <geoffk@geoffk.org> 
(via an automated GCC regression-testing script.)


More information about the Gcc-regression mailing list