GCC build failure, HEAD@201338 on native

GCC regression tester regress@geoffk.org
Tue Jul 30 13:35:00 GMT 2013


With your recent patch, GCC HEAD revision 201338 had problems on:
native: build (about the same as the previous build)
Attached is build output for those targets.
The previous build was of revision 201334.

Log information for changes since the last build:
------------------------------------------------------------------------
r201337 | jason | 2013-07-30 06:28:23 -0700 (Tue, 30 Jul 2013) | 2 lines
Changed paths:
   A /trunk/gcc/testsuite/g++.dg/template/abstract1.C

	PR c++/58022
	* g++.dg/template/abstract1.C: New.
------------------------------------------------------------------------
r201338 | jason | 2013-07-30 06:28:31 -0700 (Tue, 30 Jul 2013) | 3 lines
Changed paths:
   M /trunk/gcc/cp/ChangeLog
   M /trunk/gcc/cp/semantics.c
   A /trunk/gcc/testsuite/g++.dg/cpp0x/constexpr-value4.C

	PR c++/57901
	* semantics.c (build_data_member_initialization, constexpr_fn_retval):
	Use break_out_target_exprs instead of unshare_expr.
------------------------------------------------------------------------

For more information, see <http://glutton.geoffk.org/HEAD/>.

-------------- next part --------------
../src/c++11/.libs/libc++11convenience.a(functexcept.o):/home/regress/tbox/native/build/i686-pc-linux-gnu/libstdc++-v3/include/bits/regex_grep_matcher.h:260: first defined here
../src/c++11/.libs/libc++11convenience.a(regex.o): In function `std::__detail::_BFSMatcher::_M_includes_some() const':
/home/regress/tbox/native/build/i686-pc-linux-gnu/libstdc++-v3/include/bits/regex_grep_matcher.tcc:194: multiple definition of `std::__detail::_BFSMatcher::_M_includes_some() const'
../src/c++11/.libs/libc++11convenience.a(functexcept.o):/home/regress/tbox/native/build/i686-pc-linux-gnu/libstdc++-v3/include/bits/regex_grep_matcher.tcc:194: first defined here
collect2: error: ld returned 1 exit status
make[6]: *** [libstdc++.la] Error 1
make[6]: Leaving directory `/home/regress/tbox/native/build/i686-pc-linux-gnu/libstdc++-v3/src'
make[5]: *** [all-recursive] Error 1
make[5]: Leaving directory `/home/regress/tbox/native/build/i686-pc-linux-gnu/libstdc++-v3/src'
make[4]: *** [all-recursive] Error 1
make[4]: Leaving directory `/home/regress/tbox/native/build/i686-pc-linux-gnu/libstdc++-v3'
make[3]: *** [all] Error 2
make[3]: Leaving directory `/home/regress/tbox/native/build/i686-pc-linux-gnu/libstdc++-v3'
make[2]: *** [all-stage1-target-libstdc++-v3] Error 2
make[2]: Leaving directory `/home/regress/tbox/native/build'
make[1]: *** [stage1-bubble] Error 2
make[1]: Leaving directory `/home/regress/tbox/native/build'
make: *** [bootstrap] Error 2
+ '[' -s .bad_compare ']'
+ exit 1
-------------- next part --------------

-- 
Geoffrey Keating <geoffk@geoffk.org> 
(via an automated GCC regression-testing script.)


More information about the Gcc-regression mailing list