NEW GCC build failure, HEAD@201334 on native

GCC regression tester regress@geoffk.org
Tue Jul 30 12:16:00 GMT 2013


With your recent patch, GCC HEAD revision 201334 had problems on:
native: build (NEW build failure)
Attached is build output for those targets.
The previous build was of revision 201331.

Log information for changes since the last build:
------------------------------------------------------------------------
r201333 | hubicka | 2013-07-30 05:00:42 -0700 (Tue, 30 Jul 2013) | 4 lines
Changed paths:
   M /trunk/gcc/ChangeLog
   M /trunk/gcc/profile.c


	* profile.c (compute_value_histograms): Do not ICE when
	there is mismatch only on some counters.

------------------------------------------------------------------------
r201334 | timshen | 2013-07-30 05:02:55 -0700 (Tue, 30 Jul 2013) | 17 lines
Changed paths:
   M /trunk/libstdc++-v3/ChangeLog
   M /trunk/libstdc++-v3/include/bits/regex.h
   M /trunk/libstdc++-v3/include/bits/regex_compiler.h
   M /trunk/libstdc++-v3/include/bits/regex_grep_matcher.h
   M /trunk/libstdc++-v3/include/bits/regex_grep_matcher.tcc
   M /trunk/libstdc++-v3/include/bits/regex_nfa.h
   M /trunk/libstdc++-v3/include/std/regex
   M /trunk/libstdc++-v3/testsuite/28_regex/algorithms/regex_match/extended/53622.cc
   M /trunk/libstdc++-v3/testsuite/28_regex/algorithms/regex_match/extended/57173.cc
   A /trunk/libstdc++-v3/testsuite/28_regex/algorithms/regex_match/extended/string_dispatch_01.cc

2013-07-30  Tim Shen  <timshen91@gmail.com>

	Thompson matcher refactored. Fix grouping problem.
	* include/bits/regex.h: Use a dispatcher _M_get_matcher().
	* include/bits/regex_compiler.h: Tweak for auto switching.
	* include/bits/regex_grep_matcher.h: Class structure.
	* include/bits/regex_grep_matcher.tcc: _BFSMatcher(Thompson
	matcher) refactoring.
	* include/bits/regex_nfa.h: Change _Results's interfaces.
	* include/std/regex: Includes <map> and <queue>.
	* testsuite/28_regex/algorithms/regex_match/extended/53622.cc:
	For both matchers.
	* testsuite/28_regex/algorithms/regex_match/extended/57173.cc:
	For both matchers.
	* testsuite/28_regex/algorithms/regex_match/extended/string_dispatch_01.cc:
	New.

------------------------------------------------------------------------

For more information, see <http://glutton.geoffk.org/HEAD/>.

-------------- next part --------------
../src/c++11/.libs/libc++11convenience.a(functexcept.o):/home/regress/tbox/native/build/i686-pc-linux-gnu/libstdc++-v3/include/bits/regex_grep_matcher.h:260: first defined here
../src/c++11/.libs/libc++11convenience.a(regex.o): In function `std::__detail::_BFSMatcher::_M_includes_some() const':
/home/regress/tbox/native/build/i686-pc-linux-gnu/libstdc++-v3/include/bits/regex_grep_matcher.tcc:194: multiple definition of `std::__detail::_BFSMatcher::_M_includes_some() const'
../src/c++11/.libs/libc++11convenience.a(functexcept.o):/home/regress/tbox/native/build/i686-pc-linux-gnu/libstdc++-v3/include/bits/regex_grep_matcher.tcc:194: first defined here
collect2: error: ld returned 1 exit status
make[6]: *** [libstdc++.la] Error 1
make[6]: Leaving directory `/home/regress/tbox/native/build/i686-pc-linux-gnu/libstdc++-v3/src'
make[5]: *** [all-recursive] Error 1
make[5]: Leaving directory `/home/regress/tbox/native/build/i686-pc-linux-gnu/libstdc++-v3/src'
make[4]: *** [all-recursive] Error 1
make[4]: Leaving directory `/home/regress/tbox/native/build/i686-pc-linux-gnu/libstdc++-v3'
make[3]: *** [all] Error 2
make[3]: Leaving directory `/home/regress/tbox/native/build/i686-pc-linux-gnu/libstdc++-v3'
make[2]: *** [all-stage1-target-libstdc++-v3] Error 2
make[2]: Leaving directory `/home/regress/tbox/native/build'
make[1]: *** [stage1-bubble] Error 2
make[1]: Leaving directory `/home/regress/tbox/native/build'
make: *** [bootstrap] Error 2
+ '[' -s .bad_compare ']'
+ exit 1
-------------- next part --------------

-- 
Geoffrey Keating <geoffk@geoffk.org> 
(via an automated GCC regression-testing script.)


More information about the Gcc-regression mailing list