GCC build failure, HEAD@196202 on native

GCC regression tester regress@geoffk.org
Thu Feb 21 12:36:00 GMT 2013


With your recent patch, GCC HEAD revision 196202 had problems on:
native: build (about the same as the previous build)
Attached is build output for those targets.
The previous build was of revision 196201.

Log information for changes since the last build:
------------------------------------------------------------------------
r196202 | janus | 2013-02-21 04:26:44 -0800 (Thu, 21 Feb 2013) | 11 lines
Changed paths:
   M /trunk/gcc/fortran/ChangeLog
   M /trunk/gcc/fortran/trans-array.c
   M /trunk/gcc/testsuite/ChangeLog
   A /trunk/gcc/testsuite/gfortran.dg/proc_ptr_comp_37.f90

2013-02-21  Janus Weil  <janus@gcc.gnu.org>

	PR fortran/56385
	* trans-array.c (structure_alloc_comps): Handle procedure-pointer
	components with allocatable result.

2013-02-21  Janus Weil  <janus@gcc.gnu.org>

	PR fortran/56385
	* gfortran.dg/proc_ptr_comp_37.f90: New.

------------------------------------------------------------------------

For more information, see <http://glutton.geoffk.org/HEAD/>.

-------------- next part --------------
mv -f .deps/asan_win.Tpo .deps/asan_win.Plo
mv -f .deps/asan_report.Tpo .deps/asan_report.Plo
mv -f .deps/asan_interceptors.Tpo .deps/asan_interceptors.Plo
mv -f .deps/asan_allocator2.Tpo .deps/asan_allocator2.Plo
/bin/sh ../libtool --tag=CXX   --mode=link /home/regress/tbox/native/build/./gcc/xgcc -shared-libgcc -B/home/regress/tbox/native/build/./gcc -nostdinc++ -L/home/regress/tbox/native/build/i686-pc-linux-gnu/libstdc++-v3/src -L/home/regress/tbox/native/build/i686-pc-linux-gnu/libstdc++-v3/src/.libs -B/home/regress/tbox/objs/i686-pc-linux-gnu/bin/ -B/home/regress/tbox/objs/i686-pc-linux-gnu/lib/ -isystem /home/regress/tbox/objs/i686-pc-linux-gnu/include -isystem /home/regress/tbox/objs/i686-pc-linux-gnu/sys-include    -Wall -W -Wno-unused-parameter -Wwrite-strings -pedantic -Wno-long-long -fPIC -fno-builtin -fno-exceptions -fomit-frame-pointer -funwind-tables -fvisibility=hidden -Wno-variadic-macros -I../../libstdc++-v3/include     -I../../libstdc++-v3/include/i686-pc-linux-gnu     -I/home/regress/tbox/svn-gcc/libsanitizer/../libstdc++-v3/libsupc++ -g -O2 -D_GNU_SOURCE -version-info `grep -v '^#' /home/regress/tbox/svn-gcc/libsanitizer/asan/libtool-version` -lpthread -ldl  -o li!
 basan.la -rpath /home/regress/tbox/objs/lib asan_allocator.lo asan_allocator2.lo asan_interceptors.lo asan_mac.lo asan_malloc_mac.lo asan_new_delete.lo asan_posix.lo asan_rtl.lo asan_stats.lo asan_thread_registry.lo asan_fake_stack.lo asan_globals.lo asan_linux.lo asan_malloc_linux.lo asan_malloc_win.lo asan_poisoning.lo asan_report.lo asan_stack.lo asan_thread.lo asan_win.lo  ../sanitizer_common/libsanitizer_common.la ../interception/libinterception.la ../../libstdc++-v3/src/libstdc++.la 
libtool: link:  /home/regress/tbox/native/build/./gcc/xgcc -shared-libgcc -B/home/regress/tbox/native/build/./gcc -nostdinc++ -L/home/regress/tbox/native/build/i686-pc-linux-gnu/libstdc++-v3/src -L/home/regress/tbox/native/build/i686-pc-linux-gnu/libstdc++-v3/src/.libs -B/home/regress/tbox/objs/i686-pc-linux-gnu/bin/ -B/home/regress/tbox/objs/i686-pc-linux-gnu/lib/ -isystem /home/regress/tbox/objs/i686-pc-linux-gnu/include -isystem /home/regress/tbox/objs/i686-pc-linux-gnu/sys-include    -shared -nostdlib /usr/lib/crti.o /home/regress/tbox/native/build/./gcc/crtbeginS.o  .libs/asan_allocator.o .libs/asan_allocator2.o .libs/asan_interceptors.o .libs/asan_mac.o .libs/asan_malloc_mac.o .libs/asan_new_delete.o .libs/asan_posix.o .libs/asan_rtl.o .libs/asan_stats.o .libs/asan_thread_registry.o .libs/asan_fake_stack.o .libs/asan_globals.o .libs/asan_linux.o .libs/asan_malloc_linux.o .libs/asan_malloc_win.o .libs/asan_poisoning.o .libs/asan_report.o .libs/asan_stack.o .libs/asan_th!
 read.o .libs/asan_win.o  -Wl,--whole-archive ../sanitizer_common/.libs/libsanitizer_common.a ../interception/.libs/libinterception.a -Wl,--no-whole-archive  -Wl,-rpath -Wl,/home/regress/tbox/native/build/i686-pc-linux-gnu/libstdc++-v3/src/.libs -Wl,-rpath -Wl,/home/regress/tbox/objs/lib -L/home/regress/tbox/native/build/i686-pc-linux-gnu/libstdc++-v3/src/.libs -L/home/regress/tbox/native/build/i686-pc-linux-gnu/libstdc++-v3/src -lpthread -ldl ../../libstdc++-v3/src/.libs/libstdc++.so -lm -L/home/regress/tbox/native/build/./gcc -L/home/regress/tbox/objs/i686-pc-linux-gnu/bin -L/home/regress/tbox/objs/i686-pc-linux-gnu/lib -lc -lgcc_s /home/regress/tbox/native/build/./gcc/crtendS.o /usr/lib/crtn.o    -Wl,-soname -Wl,libasan.so.0 -o .libs/libasan.so.0.0.0
/home/regress/tbox/objs/i686-pc-linux-gnu/bin/ld: .libs/asan_rtl.o: .preinit_array section is not allowed in DSO
/home/regress/tbox/objs/i686-pc-linux-gnu/bin/ld: failed to set dynamic section sizes: Nonrepresentable section on output
collect2: error: ld returned 1 exit status
make[4]: *** [libasan.la] Error 1
make[4]: Leaving directory `/home/regress/tbox/native/build/i686-pc-linux-gnu/libsanitizer/asan'
make[3]: *** [all-recursive] Error 1
make[3]: Leaving directory `/home/regress/tbox/native/build/i686-pc-linux-gnu/libsanitizer'
make[2]: *** [all-stage1-target-libsanitizer] Error 2
make[2]: Leaving directory `/home/regress/tbox/native/build'
make[1]: *** [stage1-bubble] Error 2
make[1]: Leaving directory `/home/regress/tbox/native/build'
make: *** [bootstrap] Error 2
+ '[' -s .bad_compare ']'
+ exit 1
-------------- next part --------------

-- 
Geoffrey Keating <geoffk@geoffk.org> 
(via an automated GCC regression-testing script.)


More information about the Gcc-regression mailing list