Gcc [trunk revision 191564] failed to profiledbootstrap on x86_64!
H.J. Lu Intel64 LTO/FDO
intel64profiled@gnu-16.sc.intel.com
Thu Sep 20 15:27:00 GMT 2012
cd bld; \
RUNTESTFLAGS="--target_board='unix{-m32,}'" ../src-trunk/configure \
--prefix=/usr/local --enable-clocale=gnu --with-system-zlib --enable-shared --with-demangler-in-ld --with-build-config=bootstrap-lto --with-fpmath=sse --enable-languages=c,c++,fortran,java,lto,objc
checking build system type... x86_64-unknown-linux-gnu
checking host system type... x86_64-unknown-linux-gnu
checking target system type... x86_64-unknown-linux-gnu
checking for a BSD-compatible install... /bin/install -c
grep "Error " makelog.191564.trunk.x86_64 >> makelog.191564.trunk.x86_64.mail; \
make[7]: *** [/tmp/ccco8ZTF.ltrans21.ltrans.o] Error 1
make[6]: *** [gcov] Error 1
make[7]: *** [/tmp/ccd3SpRi.ltrans24.ltrans.o] Error 1
make[6]: *** [gcov-dump] Error 1
make[7]: *** [/tmp/ccLJrZKx.ltrans14.ltrans.o] Error 1
make[6]: *** [gcj] Error 1
make[7]: *** [/tmp/ccixJvSr.ltrans24.ltrans.o] Error 1
make[6]: *** [jvgenmain] Error 1
make[5]: *** [all-stagefeedback-gcc] Error 2
make[4]: *** [stagefeedback-bubble] Error 2
make[3]: *** [profiledbootstrap] Error 2
make[2]: *** [profiledbootstrap] Error 2
^
(SHLIB='true'; \
/export/gnu/import/git/gcc-test-profile/bld/./prev-gcc/g++ -B/export/gnu/import/git/gcc-test-profile/bld/./prev-gcc/ -B/usr/local/x86_64-unknown-linux-gnu/bin/ -nostdinc++ -B/export/gnu/import/git/gcc-test-profile/bld/prev-x86_64-unknown-linux-gnu/libstdc++-v3/src/.libs -B/export/gnu/import/git/gcc-test-profile/bld/prev-x86_64-unknown-linux-gnu/libstdc++-v3/libsupc++/.libs -I/export/gnu/import/git/gcc-test-profile/bld/prev-x86_64-unknown-linux-gnu/libstdc++-v3/include/x86_64-unknown-linux-gnu -I/export/gnu/import/git/gcc-test-profile/bld/prev-x86_64-unknown-linux-gnu/libstdc++-v3/include -I/export/gnu/import/git/gcc-test-profile/src-trunk/libstdc++-v3/libsupc++ -L/export/gnu/import/git/gcc-test-profile/bld/prev-x86_64-unknown-linux-gnu/libstdc++-v3/src/.libs -L/export/gnu/import/git/gcc-test-profile/bld/prev-x86_64-unknown-linux-gnu/libstdc++-v3/libsupc++/.libs -c -DIN_GCC_FRONTEND -g -O2 -flto=jobserver -frandom-seed=1 -fprofile-use -DIN_GCC -fno-exceptions -fno-rtti -W -Wall -Wno-narrowing -Wwrite-strings -Wcast-qual -Wmissing-format-attribute -pedantic -Wno-long-long -Wno-variadic-macros -Wno-overlength-strings -Werror -fno-common -DHAVE_CONFIG_H -I. -I. -I../../src-trunk/gcc -I../../src-trunk/gcc/. -I../../src-trunk/gcc/../include -I../../src-trunk/gcc/../libcpp/include -I../../src-trunk/gcc/../libdecnumber -I../../src-trunk/gcc/../libdecnumber/bid -I../libdecnumber -DSTANDARD_STARTFILE_PREFIX=\"../../../\" -DSTANDARD_EXEC_PREFIX=\"/usr/local/lib/gcc/\" -DSTANDARD_LIBEXEC_PREFIX=\"/usr/local/libexec/gcc/\" -DDEFAULT_TARGET_VERSION=\"4.8.0\" -DDEFAULT_TARGET_MACHINE=\"x86_64-unknown-linux-gnu\" -DSTANDARD_BINDIR_PREFIX=\"/usr/local/bin/\" -DTOOLDIR_BASE_PREFIX=\"../../../../\" `test "X${SHLIB}" = "X" || test "yes" != "yes" || echo "-DENABLE_SHARED_LIBGCC"` -DCONFIGURE_SPECS="\"\"" \
-I. -I. -I../../src-trunk/gcc -I../../src-trunk/gcc/. -I../../src-trunk/gcc/../include -I../../src-trunk/gcc/../libcpp/include -I../../src-trunk/gcc/../libdecnumber -I../../src-trunk/gcc/../libdecnumber/bid -I../libdecnumber ../../src-trunk/gcc/fortran/gfortranspec.c)
/export/gnu/import/git/gcc-test-profile/bld/./prev-gcc/g++ -B/export/gnu/import/git/gcc-test-profile/bld/./prev-gcc/ -B/usr/local/x86_64-unknown-linux-gnu/bin/ -nostdinc++ -B/export/gnu/import/git/gcc-test-profile/bld/prev-x86_64-unknown-linux-gnu/libstdc++-v3/src/.libs -B/export/gnu/import/git/gcc-test-profile/bld/prev-x86_64-unknown-linux-gnu/libstdc++-v3/libsupc++/.libs -I/export/gnu/import/git/gcc-test-profile/bld/prev-x86_64-unknown-linux-gnu/libstdc++-v3/include/x86_64-unknown-linux-gnu -I/export/gnu/import/git/gcc-test-profile/bld/prev-x86_64-unknown-linux-gnu/libstdc++-v3/include -I/export/gnu/import/git/gcc-test-profile/src-trunk/libstdc++-v3/libsupc++ -L/export/gnu/import/git/gcc-test-profile/bld/prev-x86_64-unknown-linux-gnu/libstdc++-v3/src/.libs -L/export/gnu/import/git/gcc-test-profile/bld/prev-x86_64-unknown-linux-gnu/libstdc++-v3/libsupc++/.libs -c -g -O2 -flto=jobserver -frandom-seed=1 -fprofile-use -DIN_GCC -fno-exceptions -fno-rtti -W -Wall -Wno-narrowing -Wwrite-strings -Wcast-qual -Wmissing-format-attribute -pedantic -Wno-long-long -Wno-variadic-macros -Wno-overlength-strings -Werror -fno-common -DHAVE_CONFIG_H -I. -Ilto -I../../src-trunk/gcc -I../../src-trunk/gcc/lto -I../../src-trunk/gcc/../include -I../../src-trunk/gcc/../libcpp/include -I../../src-trunk/gcc/../libdecnumber -I../../src-trunk/gcc/../libdecnumber/bid -I../libdecnumber ../../src-trunk/gcc/lto/lto-lang.c -o lto/lto-lang.o
/export/gnu/import/git/gcc-test-profile/bld/./prev-gcc/g++ -B/export/gnu/import/git/gcc-test-profile/bld/./prev-gcc/ -B/usr/local/x86_64-unknown-linux-gnu/bin/ -nostdinc++ -B/export/gnu/import/git/gcc-test-profile/bld/prev-x86_64-unknown-linux-gnu/libstdc++-v3/src/.libs -B/export/gnu/import/git/gcc-test-profile/bld/prev-x86_64-unknown-linux-gnu/libstdc++-v3/libsupc++/.libs -I/export/gnu/import/git/gcc-test-profile/bld/prev-x86_64-unknown-linux-gnu/libstdc++-v3/include/x86_64-unknown-linux-gnu -I/export/gnu/import/git/gcc-test-profile/bld/prev-x86_64-unknown-linux-gnu/libstdc++-v3/include -I/export/gnu/import/git/gcc-test-profile/src-trunk/libstdc++-v3/libsupc++ -L/export/gnu/import/git/gcc-test-profile/bld/prev-x86_64-unknown-linux-gnu/libstdc++-v3/src/.libs -L/export/gnu/import/git/gcc-test-profile/bld/prev-x86_64-unknown-linux-gnu/libstdc++-v3/libsupc++/.libs -c -g -O2 -flto=jobserver -frandom-seed=1 -fprofile-use -DIN_GCC -fno-exceptions -fno-rtti -W -Wall -Wno-narrowing -Wwrite-strings -Wcast-qual -Wmissing-format-attribute -pedantic -Wno-long-long -Wno-variadic-macros -Wno-overlength-strings -Werror -fno-common -DHAVE_CONFIG_H -I. -Ilto -I../../src-trunk/gcc -I../../src-trunk/gcc/lto -I../../src-trunk/gcc/../include -I../../src-trunk/gcc/../libcpp/include -I../../src-trunk/gcc/../libdecnumber -I../../src-trunk/gcc/../libdecnumber/bid -I../libdecnumber ../../src-trunk/gcc/lto/lto.c -o lto/lto.o
/export/gnu/import/git/gcc-test-profile/bld/./prev-gcc/g++ -B/export/gnu/import/git/gcc-test-profile/bld/./prev-gcc/ -B/usr/local/x86_64-unknown-linux-gnu/bin/ -nostdinc++ -B/export/gnu/import/git/gcc-test-profile/bld/prev-x86_64-unknown-linux-gnu/libstdc++-v3/src/.libs -B/export/gnu/import/git/gcc-test-profile/bld/prev-x86_64-unknown-linux-gnu/libstdc++-v3/libsupc++/.libs -I/export/gnu/import/git/gcc-test-profile/bld/prev-x86_64-unknown-linux-gnu/libstdc++-v3/include/x86_64-unknown-linux-gnu -I/export/gnu/import/git/gcc-test-profile/bld/prev-x86_64-unknown-linux-gnu/libstdc++-v3/include -I/export/gnu/import/git/gcc-test-profile/src-trunk/libstdc++-v3/libsupc++ -L/export/gnu/import/git/gcc-test-profile/bld/prev-x86_64-unknown-linux-gnu/libstdc++-v3/src/.libs -L/export/gnu/import/git/gcc-test-profile/bld/prev-x86_64-unknown-linux-gnu/libstdc++-v3/libsupc++/.libs -c -g -O2 -flto=jobserver -frandom-seed=1 -fprofile-use -DIN_GCC -fno-exceptions -fno-rtti -W -Wall -Wno-narrowing -Wwrite-strings -Wcast-qual -Wmissing-format-attribute -pedantic -Wno-long-long -Wno-variadic-macros -Wno-overlength-strings -Werror -fno-common -DHAVE_CONFIG_H -I. -Ilto -I../../src-trunk/gcc -I../../src-trunk/gcc/lto -I../../src-trunk/gcc/../include -I../../src-trunk/gcc/../libcpp/include -I../../src-trunk/gcc/../libdecnumber -I../../src-trunk/gcc/../libdecnumber/bid -I../libdecnumber ../../src-trunk/gcc/lto/lto-object.c -o lto/lto-object.o
/export/gnu/import/git/gcc-test-profile/bld/./prev-gcc/g++ -B/export/gnu/import/git/gcc-test-profile/bld/./prev-gcc/ -B/usr/local/x86_64-unknown-linux-gnu/bin/ -nostdinc++ -B/export/gnu/import/git/gcc-test-profile/bld/prev-x86_64-unknown-linux-gnu/libstdc++-v3/src/.libs -B/export/gnu/import/git/gcc-test-profile/bld/prev-x86_64-unknown-linux-gnu/libstdc++-v3/libsupc++/.libs -I/export/gnu/import/git/gcc-test-profile/bld/prev-x86_64-unknown-linux-gnu/libstdc++-v3/include/x86_64-unknown-linux-gnu -I/export/gnu/import/git/gcc-test-profile/bld/prev-x86_64-unknown-linux-gnu/libstdc++-v3/include -I/export/gnu/import/git/gcc-test-profile/src-trunk/libstdc++-v3/libsupc++ -L/export/gnu/import/git/gcc-test-profile/bld/prev-x86_64-unknown-linux-gnu/libstdc++-v3/src/.libs -L/export/gnu/import/git/gcc-test-profile/bld/prev-x86_64-unknown-linux-gnu/libstdc++-v3/libsupc++/.libs -c -g -O2 -flto=jobserver -frandom-seed=1 -fprofile-use -DIN_GCC -fno-exceptions -fno-rtti -W -Wall -Wno-narrowing -Wwrite-strings -Wcast-qual -Wmissing-format-attribute -pedantic -Wno-long-long -Wno-variadic-macros -Wno-overlength-strings -Werror -fno-common -DHAVE_CONFIG_H -I. -Ilto -I../../src-trunk/gcc -I../../src-trunk/gcc/lto -I../../src-trunk/gcc/../include -I../../src-trunk/gcc/../libcpp/include -I../../src-trunk/gcc/../libdecnumber -I../../src-trunk/gcc/../libdecnumber/bid -I../libdecnumber ../../src-trunk/gcc/lto/lto-partition.c -o lto/lto-partition.o
/export/gnu/import/git/gcc-test-profile/bld/./prev-gcc/g++ -B/export/gnu/import/git/gcc-test-profile/bld/./prev-gcc/ -B/usr/local/x86_64-unknown-linux-gnu/bin/ -nostdinc++ -B/export/gnu/import/git/gcc-test-profile/bld/prev-x86_64-unknown-linux-gnu/libstdc++-v3/src/.libs -B/export/gnu/import/git/gcc-test-profile/bld/prev-x86_64-unknown-linux-gnu/libstdc++-v3/libsupc++/.libs -I/export/gnu/import/git/gcc-test-profile/bld/prev-x86_64-unknown-linux-gnu/libstdc++-v3/include/x86_64-unknown-linux-gnu -I/export/gnu/import/git/gcc-test-profile/bld/prev-x86_64-unknown-linux-gnu/libstdc++-v3/include -I/export/gnu/import/git/gcc-test-profile/src-trunk/libstdc++-v3/libsupc++ -L/export/gnu/import/git/gcc-test-profile/bld/prev-x86_64-unknown-linux-gnu/libstdc++-v3/src/.libs -L/export/gnu/import/git/gcc-test-profile/bld/prev-x86_64-unknown-linux-gnu/libstdc++-v3/libsupc++/.libs -c -g -O2 -flto=jobserver -frandom-seed=1 -fprofile-use -DIN_GCC -fno-exceptions -fno-rtti -W -Wall -Wno-narrowing -Wwrite-strings -Wcast-qual -Wmissing-format-attribute -pedantic -Wno-long-long -Wno-variadic-macros -Wno-overlength-strings -Werror -fno-common -DHAVE_CONFIG_H -I. -I. -I../../src-trunk/gcc -I../../src-trunk/gcc/. -I../../src-trunk/gcc/../include -I../../src-trunk/gcc/../libcpp/include -I../../src-trunk/gcc/../libdecnumber -I../../src-trunk/gcc/../libdecnumber/bid -I../libdecnumber insn-attrtab.c -o insn-attrtab.o
/export/gnu/import/git/gcc-test-profile/bld/./prev-gcc/g++ -B/export/gnu/import/git/gcc-test-profile/bld/./prev-gcc/ -B/usr/local/x86_64-unknown-linux-gnu/bin/ -nostdinc++ -B/export/gnu/import/git/gcc-test-profile/bld/prev-x86_64-unknown-linux-gnu/libstdc++-v3/src/.libs -B/export/gnu/import/git/gcc-test-profile/bld/prev-x86_64-unknown-linux-gnu/libstdc++-v3/libsupc++/.libs -I/export/gnu/import/git/gcc-test-profile/bld/prev-x86_64-unknown-linux-gnu/libstdc++-v3/include/x86_64-unknown-linux-gnu -I/export/gnu/import/git/gcc-test-profile/bld/prev-x86_64-unknown-linux-gnu/libstdc++-v3/include -I/export/gnu/import/git/gcc-test-profile/src-trunk/libstdc++-v3/libsupc++ -L/export/gnu/import/git/gcc-test-profile/bld/prev-x86_64-unknown-linux-gnu/libstdc++-v3/src/.libs -L/export/gnu/import/git/gcc-test-profile/bld/prev-x86_64-unknown-linux-gnu/libstdc++-v3/libsupc++/.libs -c -g -O2 -flto=jobserver -frandom-seed=1 -fprofile-use -DIN_GCC -fno-exceptions -fno-rtti -W -Wall -Wno-narrowing -Wwrite-strings -Wcast-qual -Wmissing-format-attribute -pedantic -Wno-long-long -Wno-variadic-macros -Wno-overlength-strings -Werror -fno-common -DHAVE_CONFIG_H -I. -I. -I../../src-trunk/gcc -I../../src-trunk/gcc/. -I../../src-trunk/gcc/../include -I../../src-trunk/gcc/../libcpp/include -I../../src-trunk/gcc/../libdecnumber -I../../src-trunk/gcc/../libdecnumber/bid -I../libdecnumber insn-automata.c -o insn-automata.o
/export/gnu/import/git/gcc-test-profile/bld/./prev-gcc/g++ -B/export/gnu/import/git/gcc-test-profile/bld/./prev-gcc/ -B/usr/local/x86_64-unknown-linux-gnu/bin/ -nostdinc++ -B/export/gnu/import/git/gcc-test-profile/bld/prev-x86_64-unknown-linux-gnu/libstdc++-v3/src/.libs -B/export/gnu/import/git/gcc-test-profile/bld/prev-x86_64-unknown-linux-gnu/libstdc++-v3/libsupc++/.libs -I/export/gnu/import/git/gcc-test-profile/bld/prev-x86_64-unknown-linux-gnu/libstdc++-v3/include/x86_64-unknown-linux-gnu -I/export/gnu/import/git/gcc-test-profile/bld/prev-x86_64-unknown-linux-gnu/libstdc++-v3/include -I/export/gnu/import/git/gcc-test-profile/src-trunk/libstdc++-v3/libsupc++ -L/export/gnu/import/git/gcc-test-profile/bld/prev-x86_64-unknown-linux-gnu/libstdc++-v3/src/.libs -L/export/gnu/import/git/gcc-test-profile/bld/prev-x86_64-unknown-linux-gnu/libstdc++-v3/libsupc++/.libs -c -g -O2 -flto=jobserver -frandom-seed=1 -fprofile-use -DIN_GCC -fno-exceptions -fno-rtti -W -Wall -Wno-narrowing -Wwrite-strings -Wcast-qual -Wmissing-format-attribute -pedantic -Wno-long-long -Wno-variadic-macros -Wno-overlength-strings -Werror -fno-common -DHAVE_CONFIG_H -I. -I. -I../../src-trunk/gcc -I../../src-trunk/gcc/. -I../../src-trunk/gcc/../include -I../../src-trunk/gcc/../libcpp/include -I../../src-trunk/gcc/../libdecnumber -I../../src-trunk/gcc/../libdecnumber/bid -I../libdecnumber insn-dfatab.c -o insn-dfatab.o
/export/gnu/import/git/gcc-test-profile/bld/./prev-gcc/g++ -B/export/gnu/import/git/gcc-test-profile/bld/./prev-gcc/ -B/usr/local/x86_64-unknown-linux-gnu/bin/ -nostdinc++ -B/export/gnu/import/git/gcc-test-profile/bld/prev-x86_64-unknown-linux-gnu/libstdc++-v3/src/.libs -B/export/gnu/import/git/gcc-test-profile/bld/prev-x86_64-unknown-linux-gnu/libstdc++-v3/libsupc++/.libs -I/export/gnu/import/git/gcc-test-profile/bld/prev-x86_64-unknown-linux-gnu/libstdc++-v3/include/x86_64-unknown-linux-gnu -I/export/gnu/import/git/gcc-test-profile/bld/prev-x86_64-unknown-linux-gnu/libstdc++-v3/include -I/export/gnu/import/git/gcc-test-profile/src-trunk/libstdc++-v3/libsupc++ -L/export/gnu/import/git/gcc-test-profile/bld/prev-x86_64-unknown-linux-gnu/libstdc++-v3/src/.libs -L/export/gnu/import/git/gcc-test-profile/bld/prev-x86_64-unknown-linux-gnu/libstdc++-v3/libsupc++/.libs -c -g -O2 -flto=jobserver -frandom-seed=1 -fprofile-use -DIN_GCC -fno-exceptions -fno-rtti -W -Wall -Wno-narrowing -Wwrite-strings -Wcast-qual -Wmissing-format-attribute -pedantic -Wno-long-long -Wno-variadic-macros -Wno-overlength-strings -Werror -fno-common -DHAVE_CONFIG_H -I. -I. -I../../src-trunk/gcc -I../../src-trunk/gcc/. -I../../src-trunk/gcc/../include -I../../src-trunk/gcc/../libcpp/include -I../../src-trunk/gcc/../libdecnumber -I../../src-trunk/gcc/../libdecnumber/bid -I../libdecnumber insn-latencytab.c -o insn-latencytab.o
rm -rf libcommon-target.a
ar rc libcommon-target.a i386-common.o prefix.o params.o opts.o opts-common.o options.o vec.o hooks.o common/common-targhooks.o hash-table.o
ranlib libcommon-target.a
rm -rf libcommon.a
ar rc libcommon.a diagnostic.o pretty-print.o intl.o input.o version.o
ranlib libcommon.a
/export/gnu/import/git/gcc-test-profile/bld/./prev-gcc/g++ -B/export/gnu/import/git/gcc-test-profile/bld/./prev-gcc/ -B/usr/local/x86_64-unknown-linux-gnu/bin/ -nostdinc++ -B/export/gnu/import/git/gcc-test-profile/bld/prev-x86_64-unknown-linux-gnu/libstdc++-v3/src/.libs -B/export/gnu/import/git/gcc-test-profile/bld/prev-x86_64-unknown-linux-gnu/libstdc++-v3/libsupc++/.libs -I/export/gnu/import/git/gcc-test-profile/bld/prev-x86_64-unknown-linux-gnu/libstdc++-v3/include/x86_64-unknown-linux-gnu -I/export/gnu/import/git/gcc-test-profile/bld/prev-x86_64-unknown-linux-gnu/libstdc++-v3/include -I/export/gnu/import/git/gcc-test-profile/src-trunk/libstdc++-v3/libsupc++ -L/export/gnu/import/git/gcc-test-profile/bld/prev-x86_64-unknown-linux-gnu/libstdc++-v3/src/.libs -L/export/gnu/import/git/gcc-test-profile/bld/prev-x86_64-unknown-linux-gnu/libstdc++-v3/libsupc++/.libs -g -O2 -flto=jobserver -frandom-seed=1 -fprofile-use -DIN_GCC -fno-exceptions -fno-rtti -W -Wall -Wno-narrowing -Wwrite-strings -Wcast-qual -Wmissing-format-attribute -pedantic -Wno-long-long -Wno-variadic-macros -Wno-overlength-strings -Werror -fno-common -DHAVE_CONFIG_H -static-libstdc++ -static-libgcc gcov.o libcommon.a ../libcpp/libcpp.a ../libiberty/libiberty.a ../libdecnumber/libdecnumber.a -o gcov
/export/gnu/import/git/gcc-test-profile/bld/./prev-gcc/g++ -B/export/gnu/import/git/gcc-test-profile/bld/./prev-gcc/ -B/usr/local/x86_64-unknown-linux-gnu/bin/ -nostdinc++ -B/export/gnu/import/git/gcc-test-profile/bld/prev-x86_64-unknown-linux-gnu/libstdc++-v3/src/.libs -B/export/gnu/import/git/gcc-test-profile/bld/prev-x86_64-unknown-linux-gnu/libstdc++-v3/libsupc++/.libs -I/export/gnu/import/git/gcc-test-profile/bld/prev-x86_64-unknown-linux-gnu/libstdc++-v3/include/x86_64-unknown-linux-gnu -I/export/gnu/import/git/gcc-test-profile/bld/prev-x86_64-unknown-linux-gnu/libstdc++-v3/include -I/export/gnu/import/git/gcc-test-profile/src-trunk/libstdc++-v3/libsupc++ -L/export/gnu/import/git/gcc-test-profile/bld/prev-x86_64-unknown-linux-gnu/libstdc++-v3/src/.libs -L/export/gnu/import/git/gcc-test-profile/bld/prev-x86_64-unknown-linux-gnu/libstdc++-v3/libsupc++/.libs -g -O2 -flto=jobserver -frandom-seed=1 -fprofile-use -DIN_GCC -fno-exceptions -fno-rtti -W -Wall -Wno-narrowing -Wwrite-strings -Wcast-qual -Wmissing-format-attribute -pedantic -Wno-long-long -Wno-variadic-macros -Wno-overlength-strings -Werror -fno-common -DHAVE_CONFIG_H -static-libstdc++ -static-libgcc gcov-dump.o \
libcommon.a ../libcpp/libcpp.a ../libiberty/libiberty.a ../libdecnumber/libdecnumber.a -o gcov-dump
/export/gnu/import/git/gcc-test-profile/bld/./prev-gcc/g++ -B/export/gnu/import/git/gcc-test-profile/bld/./prev-gcc/ -B/usr/local/x86_64-unknown-linux-gnu/bin/ -nostdinc++ -B/export/gnu/import/git/gcc-test-profile/bld/prev-x86_64-unknown-linux-gnu/libstdc++-v3/src/.libs -B/export/gnu/import/git/gcc-test-profile/bld/prev-x86_64-unknown-linux-gnu/libstdc++-v3/libsupc++/.libs -I/export/gnu/import/git/gcc-test-profile/bld/prev-x86_64-unknown-linux-gnu/libstdc++-v3/include/x86_64-unknown-linux-gnu -I/export/gnu/import/git/gcc-test-profile/bld/prev-x86_64-unknown-linux-gnu/libstdc++-v3/include -I/export/gnu/import/git/gcc-test-profile/src-trunk/libstdc++-v3/libsupc++ -L/export/gnu/import/git/gcc-test-profile/bld/prev-x86_64-unknown-linux-gnu/libstdc++-v3/src/.libs -L/export/gnu/import/git/gcc-test-profile/bld/prev-x86_64-unknown-linux-gnu/libstdc++-v3/libsupc++/.libs -g -O2 -flto=jobserver -frandom-seed=1 -fprofile-use -DIN_GCC -fno-exceptions -fno-rtti -W -Wall -Wno-narrowing -Wwrite-strings -Wcast-qual -Wmissing-format-attribute -pedantic -Wno-long-long -Wno-variadic-macros -Wno-overlength-strings -Werror -fno-common -DHAVE_CONFIG_H -static-libstdc++ -static-libgcc -o gcj gcc.o ggc-none.o \
jvspec.o java/jcf-path.o driver-i386.o libcommon-target.a \
libcommon.a ../libcpp/libcpp.a ../libiberty/libiberty.a ../libdecnumber/libdecnumber.a
rm -f jvgenmain
/export/gnu/import/git/gcc-test-profile/bld/./prev-gcc/g++ -B/export/gnu/import/git/gcc-test-profile/bld/./prev-gcc/ -B/usr/local/x86_64-unknown-linux-gnu/bin/ -nostdinc++ -B/export/gnu/import/git/gcc-test-profile/bld/prev-x86_64-unknown-linux-gnu/libstdc++-v3/src/.libs -B/export/gnu/import/git/gcc-test-profile/bld/prev-x86_64-unknown-linux-gnu/libstdc++-v3/libsupc++/.libs -I/export/gnu/import/git/gcc-test-profile/bld/prev-x86_64-unknown-linux-gnu/libstdc++-v3/include/x86_64-unknown-linux-gnu -I/export/gnu/import/git/gcc-test-profile/bld/prev-x86_64-unknown-linux-gnu/libstdc++-v3/include -I/export/gnu/import/git/gcc-test-profile/src-trunk/libstdc++-v3/libsupc++ -L/export/gnu/import/git/gcc-test-profile/bld/prev-x86_64-unknown-linux-gnu/libstdc++-v3/src/.libs -L/export/gnu/import/git/gcc-test-profile/bld/prev-x86_64-unknown-linux-gnu/libstdc++-v3/libsupc++/.libs -g -O2 -flto=jobserver -frandom-seed=1 -fprofile-use -DIN_GCC -fno-exceptions -fno-rtti -W -Wall -Wno-narrowing -Wwrite-strings -Wcast-qual -Wmissing-format-attribute -pedantic -Wno-long-long -Wno-variadic-macros -Wno-overlength-strings -Werror -fno-common -DHAVE_CONFIG_H -static-libstdc++ -static-libgcc -o jvgenmain java/jvgenmain.o java/mangle_name.o \
libcommon.a ../libcpp/libcpp.a ../libiberty/libiberty.a ../libdecnumber/libdecnumber.a
In file included from ../../src-trunk/gcc/../libcpp/include/line-map.h:69:0,
from :185:
../../src-trunk/libiberty/hashtab.c: In function 'htab_create':
../../src-trunk/libiberty/hashtab.c:294:3: internal compiler error: in cgraph_clone_edge, at cgraphclones.c:123
return htab_create_typed_alloc (size, hash_f, eq_f, del_f, alloc_f, alloc_f,
^
Please submit a full bug report,
with preprocessed source if appropriate.
See <http://gcc.gnu.org/bugs.html> for instructions.
make[7]: *** [/tmp/ccco8ZTF.ltrans21.ltrans.o] Error 1
make[7]: *** Waiting for unfinished jobs....
lto-wrapper: make returned 2 exit status
/usr/local/x86_64-unknown-linux-gnu/bin/ld: lto-wrapper failed
collect2: error: ld returned 1 exit status
make[6]: *** [gcov] Error 1
make[6]: *** Waiting for unfinished jobs....
In file included from ../../src-trunk/libcpp/include/cpplib.h:249:0,
from :142:
../../src-trunk/libiberty/hashtab.c: In function 'htab_create':
../../src-trunk/libiberty/hashtab.c:294:3: internal compiler error: in cgraph_clone_edge, at cgraphclones.c:123
return htab_create_typed_alloc (size, hash_f, eq_f, del_f, alloc_f, alloc_f,
^
Please submit a full bug report,
with preprocessed source if appropriate.
See <http://gcc.gnu.org/bugs.html> for instructions.
make[7]: *** [/tmp/ccd3SpRi.ltrans24.ltrans.o] Error 1
make[7]: *** Waiting for unfinished jobs....
lto-wrapper: make returned 2 exit status
/usr/local/x86_64-unknown-linux-gnu/bin/ld: lto-wrapper failed
collect2: error: ld returned 1 exit status
make[6]: *** [gcov-dump] Error 1
In file included from ../../src-trunk/libcpp/lex.c:1456:0,
from :197:
../../src-trunk/libiberty/hashtab.c: In function 'htab_create':
../../src-trunk/libiberty/hashtab.c:294:3: internal compiler error: in cgraph_clone_edge, at cgraphclones.c:123
return htab_create_typed_alloc (size, hash_f, eq_f, del_f, alloc_f, alloc_f,
^
Please submit a full bug report,
with preprocessed source if appropriate.
See <http://gcc.gnu.org/bugs.html> for instructions.
make[7]: *** [/tmp/ccLJrZKx.ltrans14.ltrans.o] Error 1
make[7]: *** Waiting for unfinished jobs....
lto-wrapper: make returned 2 exit status
/usr/local/x86_64-unknown-linux-gnu/bin/ld: lto-wrapper failed
collect2: error: ld returned 1 exit status
make[6]: *** [gcj] Error 1
In file included from ../../src-trunk/libcpp/include/cpplib.h:249:0,
from :142:
../../src-trunk/libiberty/hashtab.c: In function 'htab_create':
../../src-trunk/libiberty/hashtab.c:294:3: internal compiler error: in cgraph_clone_edge, at cgraphclones.c:123
return htab_create_typed_alloc (size, hash_f, eq_f, del_f, alloc_f, alloc_f,
^
Please submit a full bug report,
with preprocessed source if appropriate.
See <http://gcc.gnu.org/bugs.html> for instructions.
make[7]: *** [/tmp/ccixJvSr.ltrans24.ltrans.o] Error 1
make[7]: *** Waiting for unfinished jobs....
lto-wrapper: make returned 2 exit status
/usr/local/x86_64-unknown-linux-gnu/bin/ld: lto-wrapper failed
collect2: error: ld returned 1 exit status
make[6]: *** [jvgenmain] Error 1
rm gcj-dbtool.pod jcf-dump.pod jv-convert.pod grmic.pod gcov.pod gcj.pod gc-analyze.pod gfdl.pod cpp.pod gij.pod gfortran.pod gcc.pod fsf-funding.pod
make[6]: Leaving directory `/export/gnu/import/git/gcc-test-profile/bld/gcc'
make[5]: *** [all-stagefeedback-gcc] Error 2
make[5]: Leaving directory `/export/gnu/import/git/gcc-test-profile/bld'
make[4]: *** [stagefeedback-bubble] Error 2
make[4]: Leaving directory `/export/gnu/import/git/gcc-test-profile/bld'
make[3]: *** [profiledbootstrap] Error 2
make[3]: Leaving directory `/export/gnu/import/git/gcc-test-profile/bld'
12663.12user 576.06system 41:49.56elapsed 527%CPU (0avgtext+0avgdata 516212maxresident)k
350848inputs+15786792outputs (7694major+117764893minor)pagefaults 0swaps
make[2]: *** [profiledbootstrap] Error 2
make[2]: Leaving directory `/export/gnu/import/git/gcc-test-profile'
More information about the Gcc-regression
mailing list