GCC build failure, HEAD@190994 on native
GCC regression tester
regress@geoffk.org
Wed Sep 5 20:35:00 GMT 2012
With your recent patch, GCC HEAD revision 190994 had problems on:
native: build (about the same as the previous build)
Attached is build output for those targets.
The previous build was of revision 190993.
Log information for changes since the last build:
------------------------------------------------------------------------
r190994 | pinskia | 2012-09-05 13:23:22 -0700 (Wed, 05 Sep 2012) | 8 lines
Changed paths:
M /trunk/gcc/ChangeLog
M /trunk/gcc/doc/md.texi
M /trunk/gcc/optabs.c
2012-09-05 Andrew Pinski <apinski@cavium.com>
* optabs.c (emit_conditional_add): Correct comment about the arguments.
Remove code which might swap op2 and op3 since they cannot be swapped.
* doc/md.texi (add@var{mode}cc): Fix document about how the arguments
are used.
------------------------------------------------------------------------
For more information, see <http://glutton.geoffk.org/HEAD/>.
-------------- next part --------------
/tmp/ccavcD2l.s:44: Error: no such instruction: `rdrand %eax'
/bin/sh ../../libtool --tag CXX --tag disable-shared --mode=compile /home/regress/tbox/native/build/./gcc/xgcc -shared-libgcc -B/home/regress/tbox/native/build/./gcc -nostdinc++ -L/home/regress/tbox/native/build/i686-pc-linux-gnu/libstdc++-v3/src -L/home/regress/tbox/native/build/i686-pc-linux-gnu/libstdc++-v3/src/.libs -B/home/regress/tbox/objs/i686-pc-linux-gnu/bin/ -B/home/regress/tbox/objs/i686-pc-linux-gnu/lib/ -isystem /home/regress/tbox/objs/i686-pc-linux-gnu/include -isystem /home/regress/tbox/objs/i686-pc-linux-gnu/sys-include -I/home/regress/tbox/svn-gcc/libstdc++-v3/../libgcc -I/home/regress/tbox/native/build/i686-pc-linux-gnu/libstdc++-v3/include/i686-pc-linux-gnu -I/home/regress/tbox/native/build/i686-pc-linux-gnu/libstdc++-v3/include -I/home/regress/tbox/svn-gcc/libstdc++-v3/libsupc++ -std=gnu++11 -prefer-pic -fno-implicit-templates -Wall -Wextra -Wwrite-strings -Wcast-qual -Wabi -fdiagnostics-show-location=once -ffunction-sections -fdata-sections -fr!
andom-seed=fstream-inst.lo -g -O2 -D_GNU_SOURCE -c -o fstream-inst.lo /home/regress/tbox/svn-gcc/libstdc++-v3/src/c++11/fstream-inst.cc
make[6]: *** [random.lo] Error 1
make[6]: *** Waiting for unfinished jobs....
libtool: compile: /home/regress/tbox/native/build/./gcc/xgcc -shared-libgcc -B/home/regress/tbox/native/build/./gcc -nostdinc++ -L/home/regress/tbox/native/build/i686-pc-linux-gnu/libstdc++-v3/src -L/home/regress/tbox/native/build/i686-pc-linux-gnu/libstdc++-v3/src/.libs -B/home/regress/tbox/objs/i686-pc-linux-gnu/bin/ -B/home/regress/tbox/objs/i686-pc-linux-gnu/lib/ -isystem /home/regress/tbox/objs/i686-pc-linux-gnu/include -isystem /home/regress/tbox/objs/i686-pc-linux-gnu/sys-include -I/home/regress/tbox/svn-gcc/libstdc++-v3/../libgcc -I/home/regress/tbox/native/build/i686-pc-linux-gnu/libstdc++-v3/include/i686-pc-linux-gnu -I/home/regress/tbox/native/build/i686-pc-linux-gnu/libstdc++-v3/include -I/home/regress/tbox/svn-gcc/libstdc++-v3/libsupc++ -std=gnu++11 -fno-implicit-templates -Wall -Wextra -Wwrite-strings -Wcast-qual -Wabi -fdiagnostics-show-location=once -ffunction-sections -fdata-sections -frandom-seed=thread.lo -g -O2 -D_GNU_SOURCE -c /home/regress/tbox/svn-gcc!
/libstdc++-v3/src/c++11/thread.cc -fPIC -DPIC -o thread.o
libtool: compile: /home/regress/tbox/native/build/./gcc/xgcc -shared-libgcc -B/home/regress/tbox/native/build/./gcc -nostdinc++ -L/home/regress/tbox/native/build/i686-pc-linux-gnu/libstdc++-v3/src -L/home/regress/tbox/native/build/i686-pc-linux-gnu/libstdc++-v3/src/.libs -B/home/regress/tbox/objs/i686-pc-linux-gnu/bin/ -B/home/regress/tbox/objs/i686-pc-linux-gnu/lib/ -isystem /home/regress/tbox/objs/i686-pc-linux-gnu/include -isystem /home/regress/tbox/objs/i686-pc-linux-gnu/sys-include -I/home/regress/tbox/svn-gcc/libstdc++-v3/../libgcc -I/home/regress/tbox/native/build/i686-pc-linux-gnu/libstdc++-v3/include/i686-pc-linux-gnu -I/home/regress/tbox/native/build/i686-pc-linux-gnu/libstdc++-v3/include -I/home/regress/tbox/svn-gcc/libstdc++-v3/libsupc++ -std=gnu++11 -fno-implicit-templates -Wall -Wextra -Wwrite-strings -Wcast-qual -Wabi -fdiagnostics-show-location=once -ffunction-sections -fdata-sections -frandom-seed=fstream-inst.lo -g -O2 -D_GNU_SOURCE -c /home/regress/tbox/s!
vn-gcc/libstdc++-v3/src/c++11/fstream-inst.cc -fPIC -DPIC -o fstream-inst.o
make[6]: Leaving directory `/home/regress/tbox/native/build/i686-pc-linux-gnu/libstdc++-v3/src/c++11'
make[5]: *** [all-recursive] Error 1
make[5]: Leaving directory `/home/regress/tbox/native/build/i686-pc-linux-gnu/libstdc++-v3/src'
make[4]: *** [all-recursive] Error 1
make[4]: Leaving directory `/home/regress/tbox/native/build/i686-pc-linux-gnu/libstdc++-v3'
make[3]: *** [all] Error 2
make[3]: Leaving directory `/home/regress/tbox/native/build/i686-pc-linux-gnu/libstdc++-v3'
make[2]: *** [all-stage1-target-libstdc++-v3] Error 2
make[2]: Leaving directory `/home/regress/tbox/native/build'
make[1]: *** [stage1-bubble] Error 2
make[1]: Leaving directory `/home/regress/tbox/native/build'
make: *** [bootstrap] Error 2
+ '[' -s .bad_compare ']'
+ exit 1
-------------- next part --------------
--
Geoffrey Keating <geoffk@geoffk.org>
(via an automated GCC regression-testing script.)
More information about the Gcc-regression
mailing list