GCC build failure, HEAD@185025 on native

GCC regression tester regress@geoffk.org
Wed Mar 7 01:22:00 GMT 2012


With your recent patch, GCC HEAD revision 185025 had problems on:
native: build (about the same as the previous build)
Attached is build output for those targets.
The previous build was of revision 185024.

Log information for changes since the last build:
------------------------------------------------------------------------
r185025 | ian | 2012-03-06 17:16:20 -0800 (Tue, 06 Mar 2012) | 2 lines
Changed paths:
   M /trunk/libgo/Makefile.am
   M /trunk/libgo/Makefile.in
   M /trunk/libgo/go/debug/dwarf/const.go
   M /trunk/libgo/go/debug/dwarf/entry.go
   A /trunk/libgo/go/debug/dwarf/line.go
   A /trunk/libgo/go/debug/dwarf/line_test.go
   M /trunk/libgo/go/debug/dwarf/unit.go
   M /trunk/libgo/go/debug/elf/elf_test.go
   M /trunk/libgo/go/debug/elf/file.go
   M /trunk/libgo/go/debug/elf/file_test.go
   A /trunk/libgo/go/debug/elf/runtime.go
   M /trunk/libgo/go/debug/macho/file.go
   M /trunk/libgo/go/debug/macho/file_test.go
   M /trunk/libgo/go/encoding/binary/binary_test.go
   A /trunk/libgo/go/encoding/binary/export_test.go
   M /trunk/libgo/go/encoding/binary/varint_test.go
   M /trunk/libgo/go/log/log.go
   M /trunk/libgo/go/log/log_test.go
   M /trunk/libgo/go/net/http/pprof/pprof.go
   M /trunk/libgo/go/net/ip_test.go
   M /trunk/libgo/go/runtime/debug/stack.go
   M /trunk/libgo/go/runtime/extern.go
   M /trunk/libgo/go/runtime/pprof/pprof.go
   M /trunk/libgo/go/testing/testing.go
   M /trunk/libgo/runtime/go-caller.c
   M /trunk/libgo/runtime/go-callers.c
   M /trunk/libgo/runtime/mprof.goc
   M /trunk/libgo/runtime/runtime.c
   M /trunk/libgo/runtime/runtime.h

libgo: Implement and use runtime.Caller, runtime.Func.FileLine.

------------------------------------------------------------------------

For more information, see <http://glutton.geoffk.org/HEAD/>.

-------------- next part --------------
/home/regress/tbox/svn-gcc/libgcc/config/libbid/bid128_fma.c:249:1: internal compiler error: Segmentation fault
Please submit a full bug report,
with preprocessed source if appropriate.
See <http://gcc.gnu.org/bugs.html> for instructions.
make[3]: *** [bid128_fma.o] Error 1
make[3]: *** Waiting for unfinished jobs....
/home/regress/tbox/svn-gcc/libgcc/config/libbid/bid_binarydecimal.c: In function '__bid32_to_binary32':
/home/regress/tbox/svn-gcc/libgcc/config/libbid/bid_binarydecimal.c:144038:1: internal compiler error: Segmentation fault
Please submit a full bug report,
with preprocessed source if appropriate.
See <http://gcc.gnu.org/bugs.html> for instructions.
make[3]: *** [bid_binarydecimal.o] Error 1
make[3]: Leaving directory `/home/regress/tbox/native/build/i686-pc-linux-gnu/libgcc'
make[2]: *** [all-stage1-target-libgcc] Error 2
make[2]: Leaving directory `/home/regress/tbox/native/build'
make[1]: *** [stage1-bubble] Error 2
make[1]: Leaving directory `/home/regress/tbox/native/build'
make: *** [bootstrap] Error 2
+ '[' -s .bad_compare ']'
+ exit 1
-------------- next part --------------

-- 
Geoffrey Keating <geoffk@geoffk.org> 
(via an automated GCC regression-testing script.)


More information about the Gcc-regression mailing list