Gcc [trunk revision 188876] failed to bootstrap on x86_64!

H.J. Lu Intel64 Core 2/i7 intel64corei7@gnu-34.sc.intel.com
Fri Jun 22 09:19:00 GMT 2012


cd bld; \
 RUNTESTFLAGS="--target_board='unix{-m32,}'" ../src-trunk/configure \
	--with-arch=core2 --with-cpu=core2 --prefix=/usr/local --enable-clocale=gnu --with-system-zlib --enable-shared --with-demangler-in-ld --with-fpmath=sse --enable-languages=c,c++,fortran,java,lto,objc
checking build system type... x86_64-unknown-linux-gnu
checking host system type... x86_64-unknown-linux-gnu
checking target system type... x86_64-unknown-linux-gnu
checking for a BSD-compatible install... /usr/bin/install -c
    grep "Error " makelog.188876.trunk.x86_64.core2 >> makelog.188876.trunk.x86_64.core2.mail; \
make[6]: *** [build/gcov-iov.o] Error 1
make[5]: *** [all-stage2-gcc] Error 2
make[4]: *** [stage2-bubble] Error 2
make[3]: *** [bootstrap] Error 2
make[2]: *** [bootstrap] Error 2
build/genpreds ../../src-trunk/gcc/config/i386/i386.md > tmp-preds.c
/export/gnu/import/git/gcc-test-intel64corei7/bld/./prev-gcc/g++ -B/export/gnu/import/git/gcc-test-intel64corei7/bld/./prev-gcc/ -B/usr/local/x86_64-unknown-linux-gnu/bin/ -nostdinc++ -B/export/gnu/import/git/gcc-test-intel64corei7/bld/prev-x86_64-unknown-linux-gnu/libstdc++-v3/src/.libs -B/export/gnu/import/git/gcc-test-intel64corei7/bld/prev-x86_64-unknown-linux-gnu/libstdc++-v3/libsupc++/.libs -I/export/gnu/import/git/gcc-test-intel64corei7/bld/prev-x86_64-unknown-linux-gnu/libstdc++-v3/include/x86_64-unknown-linux-gnu -I/export/gnu/import/git/gcc-test-intel64corei7/bld/prev-x86_64-unknown-linux-gnu/libstdc++-v3/include -I/export/gnu/import/git/gcc-test-intel64corei7/src-trunk/libstdc++-v3/libsupc++ -L/export/gnu/import/git/gcc-test-intel64corei7/bld/prev-x86_64-unknown-linux-gnu/libstdc++-v3/src/.libs -L/export/gnu/import/git/gcc-test-intel64corei7/bld/prev-x86_64-unknown-linux-gnu/libstdc++-v3/libsupc++/.libs   -g -O2 -gtoggle -DIN_GCC   -fno-exceptions -fno-rtti -W -Wall -Wno-narrowing -Wwrite-strings -Wcast-qual -Wmissing-format-attribute -pedantic -Wno-long-long -Wno-variadic-macros -Wno-overlength-strings -Werror -fno-common  -DHAVE_CONFIG_H -DGENERATOR_FILE -static-libstdc++ -static-libgcc  -o build/genrecog \
    build/genrecog.o build/rtl.o build/read-rtl.o build/ggc-none.o build/vec.o build/min-insn-modes.o build/gensupport.o build/print-rtl.o build/read-md.o build/errors.o .././libiberty/libiberty.a
build/genconditions ../../src-trunk/gcc/config/i386/i386.md > tmp-condmd.c
build/genpreds -h ../../src-trunk/gcc/config/i386/i386.md > tmp-preds.h
build/genpreds -c ../../src-trunk/gcc/config/i386/i386.md > tmp-constrs.h
/bin/sh ../../src-trunk/gcc/../move-if-change tmp-constrs.h tm-constrs.h
echo timestamp > s-constrs-h
/bin/sh ../../src-trunk/gcc/../move-if-change tmp-preds.c insn-preds.c
/bin/sh ../../src-trunk/gcc/../move-if-change tmp-preds.h tm-preds.h
echo timestamp > s-preds
/bin/sh ../../src-trunk/gcc/../move-if-change tmp-condmd.c build/gencondmd.c
echo timestamp > s-preds-h
echo timestamp > s-conditions
/export/gnu/import/git/gcc-test-intel64corei7/bld/./prev-gcc/g++ -B/export/gnu/import/git/gcc-test-intel64corei7/bld/./prev-gcc/ -B/usr/local/x86_64-unknown-linux-gnu/bin/ -nostdinc++ -B/export/gnu/import/git/gcc-test-intel64corei7/bld/prev-x86_64-unknown-linux-gnu/libstdc++-v3/src/.libs -B/export/gnu/import/git/gcc-test-intel64corei7/bld/prev-x86_64-unknown-linux-gnu/libstdc++-v3/libsupc++/.libs -I/export/gnu/import/git/gcc-test-intel64corei7/bld/prev-x86_64-unknown-linux-gnu/libstdc++-v3/include/x86_64-unknown-linux-gnu -I/export/gnu/import/git/gcc-test-intel64corei7/bld/prev-x86_64-unknown-linux-gnu/libstdc++-v3/include -I/export/gnu/import/git/gcc-test-intel64corei7/src-trunk/libstdc++-v3/libsupc++ -L/export/gnu/import/git/gcc-test-intel64corei7/bld/prev-x86_64-unknown-linux-gnu/libstdc++-v3/src/.libs -L/export/gnu/import/git/gcc-test-intel64corei7/bld/prev-x86_64-unknown-linux-gnu/libstdc++-v3/libsupc++/.libs -c   -g -O2 -gtoggle -DIN_GCC   -fno-exceptions -fno-rtti -W -Wall -Wno-narrowing -Wwrite-strings -Wcast-qual -Wmissing-format-attribute -pedantic -Wno-long-long -Wno-variadic-macros -Wno-overlength-strings -Werror -fno-common  -DHAVE_CONFIG_H -DGENERATOR_FILE -I. -Ibuild -I../../src-trunk/gcc -I../../src-trunk/gcc/build -I../../src-trunk/gcc/../include -I../../src-trunk/gcc/../libcpp/include  -I../../src-trunk/gcc/../libdecnumber -I../../src-trunk/gcc/../libdecnumber/bid -I../libdecnumber    \
	-o build/gencondmd.o build/gencondmd.c
/export/gnu/import/git/gcc-test-intel64corei7/bld/./prev-gcc/g++ -B/export/gnu/import/git/gcc-test-intel64corei7/bld/./prev-gcc/ -B/usr/local/x86_64-unknown-linux-gnu/bin/ -nostdinc++ -B/export/gnu/import/git/gcc-test-intel64corei7/bld/prev-x86_64-unknown-linux-gnu/libstdc++-v3/src/.libs -B/export/gnu/import/git/gcc-test-intel64corei7/bld/prev-x86_64-unknown-linux-gnu/libstdc++-v3/libsupc++/.libs -I/export/gnu/import/git/gcc-test-intel64corei7/bld/prev-x86_64-unknown-linux-gnu/libstdc++-v3/include/x86_64-unknown-linux-gnu -I/export/gnu/import/git/gcc-test-intel64corei7/bld/prev-x86_64-unknown-linux-gnu/libstdc++-v3/include -I/export/gnu/import/git/gcc-test-intel64corei7/src-trunk/libstdc++-v3/libsupc++ -L/export/gnu/import/git/gcc-test-intel64corei7/bld/prev-x86_64-unknown-linux-gnu/libstdc++-v3/src/.libs -L/export/gnu/import/git/gcc-test-intel64corei7/bld/prev-x86_64-unknown-linux-gnu/libstdc++-v3/libsupc++/.libs   -g -O2 -gtoggle -DIN_GCC   -fno-exceptions -fno-rtti -W -Wall -Wno-narrowing -Wwrite-strings -Wcast-qual -Wmissing-format-attribute -pedantic -Wno-long-long -Wno-variadic-macros -Wno-overlength-strings -Werror -fno-common  -DHAVE_CONFIG_H -DGENERATOR_FILE -static-libstdc++ -static-libgcc  -o build/genautomata \
    build/genautomata.o build/rtl.o build/read-rtl.o build/ggc-none.o build/vec.o build/min-insn-modes.o build/gensupport.o build/print-rtl.o build/read-md.o build/errors.o .././libiberty/libiberty.a -lm
/export/gnu/import/git/gcc-test-intel64corei7/bld/./prev-gcc/g++ -B/export/gnu/import/git/gcc-test-intel64corei7/bld/./prev-gcc/ -B/usr/local/x86_64-unknown-linux-gnu/bin/ -nostdinc++ -B/export/gnu/import/git/gcc-test-intel64corei7/bld/prev-x86_64-unknown-linux-gnu/libstdc++-v3/src/.libs -B/export/gnu/import/git/gcc-test-intel64corei7/bld/prev-x86_64-unknown-linux-gnu/libstdc++-v3/libsupc++/.libs -I/export/gnu/import/git/gcc-test-intel64corei7/bld/prev-x86_64-unknown-linux-gnu/libstdc++-v3/include/x86_64-unknown-linux-gnu -I/export/gnu/import/git/gcc-test-intel64corei7/bld/prev-x86_64-unknown-linux-gnu/libstdc++-v3/include -I/export/gnu/import/git/gcc-test-intel64corei7/src-trunk/libstdc++-v3/libsupc++ -L/export/gnu/import/git/gcc-test-intel64corei7/bld/prev-x86_64-unknown-linux-gnu/libstdc++-v3/src/.libs -L/export/gnu/import/git/gcc-test-intel64corei7/bld/prev-x86_64-unknown-linux-gnu/libstdc++-v3/libsupc++/.libs   -g -O2 -gtoggle -DIN_GCC   -fno-exceptions -fno-rtti -W -Wall -Wno-narrowing -Wwrite-strings -Wcast-qual -Wmissing-format-attribute -pedantic -Wno-long-long -Wno-variadic-macros -Wno-overlength-strings -Werror -fno-common  -DHAVE_CONFIG_H -DGENERATOR_FILE -static-libstdc++ -static-libgcc  -o build/gencondmd \
    build/gencondmd.o .././libiberty/libiberty.a
build/gencondmd > tmp-cond.md
/bin/sh ../../src-trunk/gcc/../move-if-change tmp-cond.md insn-conditions.md
echo timestamp > s-condmd
build/genflags ../../src-trunk/gcc/config/i386/i386.md \
  insn-conditions.md > tmp-flags.h
build/genattr ../../src-trunk/gcc/config/i386/i386.md \
  insn-conditions.md > tmp-attr.h
build/genattr-common ../../src-trunk/gcc/config/i386/i386.md \
  insn-conditions.md > tmp-attr-common.h
build/gencodes ../../src-trunk/gcc/config/i386/i386.md \
  insn-conditions.md > tmp-codes.h
build/genconfig ../../src-trunk/gcc/config/i386/i386.md \
  insn-conditions.md > tmp-config.h
build/genattrtab ../../src-trunk/gcc/config/i386/i386.md insn-conditions.md \
	-Atmp-attrtab.c -Dtmp-dfatab.c -Ltmp-latencytab.c
build/genautomata ../../src-trunk/gcc/config/i386/i386.md \
  insn-conditions.md > tmp-automata.c
build/genemit ../../src-trunk/gcc/config/i386/i386.md \
  insn-conditions.md > tmp-emit.c
build/genextract ../../src-trunk/gcc/config/i386/i386.md \
  insn-conditions.md > tmp-extract.c
build/genopinit ../../src-trunk/gcc/config/i386/i386.md \
  insn-conditions.md > tmp-opinit.c
build/genoutput ../../src-trunk/gcc/config/i386/i386.md \
  insn-conditions.md > tmp-output.c
build/genpeep ../../src-trunk/gcc/config/i386/i386.md \
  insn-conditions.md > tmp-peep.c
/bin/sh ../../src-trunk/gcc/../move-if-change tmp-attr.h insn-attr.h
/bin/sh ../../src-trunk/gcc/../move-if-change tmp-attr-common.h insn-attr-common.h
/bin/sh ../../src-trunk/gcc/../move-if-change tmp-config.h insn-config.h
/bin/sh ../../src-trunk/gcc/../move-if-change tmp-codes.h insn-codes.h
echo timestamp > s-attr
/bin/sh ../../src-trunk/gcc/../move-if-change tmp-peep.c insn-peep.c
/bin/sh ../../src-trunk/gcc/../move-if-change tmp-flags.h insn-flags.h
echo timestamp > s-attr-common
echo timestamp > s-config
build/genrecog ../../src-trunk/gcc/config/i386/i386.md \
  insn-conditions.md > tmp-recog.c
/bin/sh ../../src-trunk/gcc/../move-if-change tmp-emit.c insn-emit.c
/bin/sh ../../src-trunk/gcc/../move-if-change tmp-extract.c insn-extract.c
echo timestamp > s-codes
echo timestamp > s-peep
echo timestamp > s-flags
echo timestamp > s-emit
echo timestamp > s-extract
/bin/sh ../../src-trunk/gcc/../move-if-change tmp-opinit.c insn-opinit.c
(SHLIB='true'; \
/export/gnu/import/git/gcc-test-intel64corei7/bld/./prev-gcc/g++ -B/export/gnu/import/git/gcc-test-intel64corei7/bld/./prev-gcc/ -B/usr/local/x86_64-unknown-linux-gnu/bin/ -nostdinc++ -B/export/gnu/import/git/gcc-test-intel64corei7/bld/prev-x86_64-unknown-linux-gnu/libstdc++-v3/src/.libs -B/export/gnu/import/git/gcc-test-intel64corei7/bld/prev-x86_64-unknown-linux-gnu/libstdc++-v3/libsupc++/.libs -I/export/gnu/import/git/gcc-test-intel64corei7/bld/prev-x86_64-unknown-linux-gnu/libstdc++-v3/include/x86_64-unknown-linux-gnu -I/export/gnu/import/git/gcc-test-intel64corei7/bld/prev-x86_64-unknown-linux-gnu/libstdc++-v3/include -I/export/gnu/import/git/gcc-test-intel64corei7/src-trunk/libstdc++-v3/libsupc++ -L/export/gnu/import/git/gcc-test-intel64corei7/bld/prev-x86_64-unknown-linux-gnu/libstdc++-v3/src/.libs -L/export/gnu/import/git/gcc-test-intel64corei7/bld/prev-x86_64-unknown-linux-gnu/libstdc++-v3/libsupc++/.libs -c   -g -O2 -gtoggle -DIN_GCC   -fno-exceptions -fno-rtti -W -Wall -Wno-narrowing -Wwrite-strings -Wcast-qual -Wmissing-format-attribute -pedantic -Wno-long-long -Wno-variadic-macros -Wno-overlength-strings -Werror -fno-common  -DHAVE_CONFIG_H -I. -I. -I../../src-trunk/gcc -I../../src-trunk/gcc/. -I../../src-trunk/gcc/../include -I../../src-trunk/gcc/../libcpp/include  -I../../src-trunk/gcc/../libdecnumber -I../../src-trunk/gcc/../libdecnumber/bid -I../libdecnumber    -DSTANDARD_STARTFILE_PREFIX=\"../../../\" -DSTANDARD_EXEC_PREFIX=\"/usr/local/lib/gcc/\" -DSTANDARD_LIBEXEC_PREFIX=\"/usr/local/libexec/gcc/\" -DDEFAULT_TARGET_VERSION=\"4.8.0\" -DDEFAULT_TARGET_MACHINE=\"x86_64-unknown-linux-gnu\" -DSTANDARD_BINDIR_PREFIX=\"/usr/local/bin/\" -DTOOLDIR_BASE_PREFIX=\"../../../../\"  `test "X${SHLIB}" = "X" || test "yes" != "yes" || echo "-DENABLE_SHARED_LIBGCC"` -DCONFIGURE_SPECS="\"\"" \
	-I. -I. -I../../src-trunk/gcc -I../../src-trunk/gcc/. -I../../src-trunk/gcc/../include -I../../src-trunk/gcc/../libcpp/include  -I../../src-trunk/gcc/../libdecnumber -I../../src-trunk/gcc/../libdecnumber/bid -I../libdecnumber   ../../src-trunk/gcc/cp/g++spec.c)
echo timestamp > s-opinit
/export/gnu/import/git/gcc-test-intel64corei7/bld/./prev-gcc/g++ -B/export/gnu/import/git/gcc-test-intel64corei7/bld/./prev-gcc/ -B/usr/local/x86_64-unknown-linux-gnu/bin/ -nostdinc++ -B/export/gnu/import/git/gcc-test-intel64corei7/bld/prev-x86_64-unknown-linux-gnu/libstdc++-v3/src/.libs -B/export/gnu/import/git/gcc-test-intel64corei7/bld/prev-x86_64-unknown-linux-gnu/libstdc++-v3/libsupc++/.libs -I/export/gnu/import/git/gcc-test-intel64corei7/bld/prev-x86_64-unknown-linux-gnu/libstdc++-v3/include/x86_64-unknown-linux-gnu -I/export/gnu/import/git/gcc-test-intel64corei7/bld/prev-x86_64-unknown-linux-gnu/libstdc++-v3/include -I/export/gnu/import/git/gcc-test-intel64corei7/src-trunk/libstdc++-v3/libsupc++ -L/export/gnu/import/git/gcc-test-intel64corei7/bld/prev-x86_64-unknown-linux-gnu/libstdc++-v3/src/.libs -L/export/gnu/import/git/gcc-test-intel64corei7/bld/prev-x86_64-unknown-linux-gnu/libstdc++-v3/libsupc++/.libs -c   -g -O2 -gtoggle -DIN_GCC   -fno-exceptions -fno-rtti -W -Wall -Wno-narrowing -Wwrite-strings -Wcast-qual -Wmissing-format-attribute -pedantic -Wno-long-long -Wno-variadic-macros -Wno-overlength-strings -Werror -fno-common  -DHAVE_CONFIG_H -DGENERATOR_FILE -I. -Ibuild -I../../src-trunk/gcc -I../../src-trunk/gcc/build -I../../src-trunk/gcc/../include -I../../src-trunk/gcc/../libcpp/include  -I../../src-trunk/gcc/../libdecnumber -I../../src-trunk/gcc/../libdecnumber/bid -I../libdecnumber    \
	-o build/gcov-iov.o ../../src-trunk/gcc/gcov-iov.c
../../src-trunk/gcc/gcov-iov.c: In function 'int main(int, char**)':
../../src-trunk/gcc/gcov-iov.c:58:39: error: 'strcmp' was not declared in this scope
       || strcmp (argv[2], "prerelease") == 0)
                                       ^
make[6]: *** [build/gcov-iov.o] Error 1
make[6]: *** Waiting for unfinished jobs....
/bin/sh ../../src-trunk/gcc/../move-if-change tmp-recog.c insn-recog.c
echo timestamp > s-recog
/bin/sh ../../src-trunk/gcc/../move-if-change tmp-output.c insn-output.c
echo timestamp > s-output
/bin/sh ../../src-trunk/gcc/../move-if-change tmp-attrtab.c    insn-attrtab.c
/bin/sh ../../src-trunk/gcc/../move-if-change tmp-dfatab.c     insn-dfatab.c
/bin/sh ../../src-trunk/gcc/../move-if-change tmp-latencytab.c insn-latencytab.c
echo timestamp > s-attrtab
/bin/sh ../../src-trunk/gcc/../move-if-change tmp-automata.c insn-automata.c
echo timestamp > s-automata
rm gcj-dbtool.pod jcf-dump.pod jv-convert.pod grmic.pod gcj.pod gc-analyze.pod gcov.pod gfdl.pod cpp.pod gij.pod gfortran.pod gcc.pod fsf-funding.pod
make[6]: Leaving directory `/export/gnu/import/git/gcc-test-intel64corei7/bld/gcc'
make[5]: *** [all-stage2-gcc] Error 2
make[5]: Leaving directory `/export/gnu/import/git/gcc-test-intel64corei7/bld'
make[4]: *** [stage2-bubble] Error 2
make[4]: Leaving directory `/export/gnu/import/git/gcc-test-intel64corei7/bld'
make[3]: *** [bootstrap] Error 2
make[3]: Leaving directory `/export/gnu/import/git/gcc-test-intel64corei7/bld'
1994.22user 127.22system 8:17.26elapsed 426%CPU (0avgtext+0avgdata 560092maxresident)k
157512inputs+6632280outputs (9major+56001851minor)pagefaults 0swaps
make[2]: *** [bootstrap] Error 2
make[2]: Leaving directory `/export/gnu/import/git/gcc-test-intel64corei7'



More information about the Gcc-regression mailing list