NEW GCC build failure, HEAD@188879 on native

GCC regression tester regress@geoffk.org
Fri Jun 22 09:05:00 GMT 2012


With your recent patch, GCC HEAD revision 188879 had problems on:
native: build (NEW build failure)
Attached is build output for those targets.
The previous build was of revision 188872.

Log information for changes since the last build:
------------------------------------------------------------------------
r188874 | ebotcazou | 2012-06-22 00:18:50 -0700 (Fri, 22 Jun 2012) | 4 lines
Changed paths:
   M /trunk/gcc/ChangeLog
   M /trunk/gcc/dwarf2out.c

	PR debug/53704
	* dwarf2out.c (gen_compile_unit_die): Use DW_LANG_Fortran90 as language
	for GNU Fortran if in strict DWARF2 mode.

------------------------------------------------------------------------
r188875 | ebotcazou | 2012-06-22 00:22:42 -0700 (Fri, 22 Jun 2012) | 1 line
Changed paths:
   M /trunk/gcc/ChangeLog

Fix entry
------------------------------------------------------------------------
r188876 | rguenth | 2012-06-22 01:07:47 -0700 (Fri, 22 Jun 2012) | 5 lines
Changed paths:
   M /trunk/gcc/ChangeLog
   M /trunk/gcc/gcov-iov.c

2012-06-22  Richard Guenther  <rguenther@suse.de>

	PR gcov-profile/53744
	* gcov-iov.c (main): Treat "" and "prerelease" the same.

------------------------------------------------------------------------

For more information, see <http://glutton.geoffk.org/HEAD/>.

-------------- next part --------------
/home/regress/tbox/svn-gcc/gcc/gcov-iov.c:58:39: error: 'strcmp' was not declared in this scope
       || strcmp (argv[2], "prerelease") == 0)
                                       ^
make[3]: *** [build/gcov-iov.o] Error 1
make[3]: *** Waiting for unfinished jobs....
/bin/sh /home/regress/tbox/svn-gcc/gcc/../move-if-change tmp-attrtab.c    insn-attrtab.c
/bin/sh /home/regress/tbox/svn-gcc/gcc/../move-if-change tmp-dfatab.c     insn-dfatab.c
/bin/sh /home/regress/tbox/svn-gcc/gcc/../move-if-change tmp-latencytab.c insn-latencytab.c
echo timestamp > s-attrtab
/bin/sh /home/regress/tbox/svn-gcc/gcc/../move-if-change tmp-automata.c insn-automata.c
echo timestamp > s-automata
rm gcj-dbtool.pod jcf-dump.pod jv-convert.pod grmic.pod gcj.pod gc-analyze.pod cpp.pod gfdl.pod gij.pod gcov.pod gfortran.pod fsf-funding.pod gcc.pod
make[3]: Leaving directory `/home/regress/tbox/native/build/gcc'
make[2]: *** [all-stage2-gcc] Error 2
make[2]: Leaving directory `/home/regress/tbox/native/build'
make[1]: *** [stage2-bubble] Error 2
make[1]: Leaving directory `/home/regress/tbox/native/build'
make: *** [bootstrap] Error 2
+ '[' -s .bad_compare ']'
+ exit 1
-------------- next part --------------

-- 
Geoffrey Keating <geoffk@geoffk.org> 
(via an automated GCC regression-testing script.)


More information about the Gcc-regression mailing list