Gcc [trunk revision 189472] failed to profiledbootstrap on x86_64!

H.J. Lu Intel64 LTO/FDO intel64profiled@gnu-16.sc.intel.com
Fri Jul 13 23:48:00 GMT 2012


cd bld; \
 RUNTESTFLAGS="--target_board='unix{-m32,}'" ../src-trunk/configure \
	 --prefix=/usr/local --enable-clocale=gnu --with-system-zlib --enable-shared --with-demangler-in-ld --with-build-config=bootstrap-lto --with-fpmath=sse --enable-languages=c,c++,fortran,java,lto,objc
checking build system type... x86_64-unknown-linux-gnu
checking host system type... x86_64-unknown-linux-gnu
checking target system type... x86_64-unknown-linux-gnu
checking for a BSD-compatible install... /usr/bin/install -c
    grep "Error " makelog.189472.trunk.x86_64 >> makelog.189472.trunk.x86_64.mail; \
make[5]: *** [configure-stagefeedback-target-libgcc] Error 1
make[4]: *** [stagefeedback-bubble] Error 2
make[3]: *** [profiledbootstrap] Error 2
make[2]: *** [profiledbootstrap] Error 2
  cc1-checksum.o libbackend.a main.o tree-browser.o libcommon-target.a libcommon.a ../libcpp/libcpp.a ../libdecnumber/libdecnumber.a libcommon.a ../libcpp/libcpp.a   ../libiberty/libiberty.a ../libdecnumber/libdecnumber.a   -lmpc -lmpfr -lgmp -rdynamic -ldl  -lz
/export/gnu/import/git/gcc-test-profile/bld/./prev-gcc/g++ -B/export/gnu/import/git/gcc-test-profile/bld/./prev-gcc/ -B/usr/local/x86_64-unknown-linux-gnu/bin/ -nostdinc++ -B/export/gnu/import/git/gcc-test-profile/bld/prev-x86_64-unknown-linux-gnu/libstdc++-v3/src/.libs -B/export/gnu/import/git/gcc-test-profile/bld/prev-x86_64-unknown-linux-gnu/libstdc++-v3/libsupc++/.libs -I/export/gnu/import/git/gcc-test-profile/bld/prev-x86_64-unknown-linux-gnu/libstdc++-v3/include/x86_64-unknown-linux-gnu -I/export/gnu/import/git/gcc-test-profile/bld/prev-x86_64-unknown-linux-gnu/libstdc++-v3/include -I/export/gnu/import/git/gcc-test-profile/src-trunk/libstdc++-v3/libsupc++ -L/export/gnu/import/git/gcc-test-profile/bld/prev-x86_64-unknown-linux-gnu/libstdc++-v3/src/.libs -L/export/gnu/import/git/gcc-test-profile/bld/prev-x86_64-unknown-linux-gnu/libstdc++-v3/libsupc++/.libs   -g -O2 -flto=jobserver -frandom-seed=1 -fprofile-use -DIN_GCC   -fno-exceptions -fno-rtti -W -Wall -Wno-narrowing -Wwrite-strings -Wcast-qual -Wmissing-format-attribute -pedantic -Wno-long-long -Wno-variadic-macros -Wno-overlength-strings -Werror -fno-common  -DHAVE_CONFIG_H -static-libstdc++ -static-libgcc  -o cc1plus \
      cp/cp-lang.o c-family/stub-objc.o cp/call.o cp/decl.o cp/expr.o cp/pt.o cp/typeck2.o cp/class.o cp/decl2.o cp/error.o cp/lex.o cp/parser.o cp/ptree.o cp/rtti.o cp/typeck.o cp/cvt.o cp/except.o cp/friend.o cp/init.o cp/method.o cp/search.o cp/semantics.o cp/tree.o cp/repo.o cp/dump.o cp/optimize.o cp/mangle.o cp/cp-objcp-common.o cp/name-lookup.o cp/cxx-pretty-print.o cp/cp-gimplify.o attribs.o incpath.o c-family/c-common.o c-family/c-cppbuiltin.o c-family/c-dump.o c-family/c-format.o c-family/c-gimplify.o c-family/c-lex.o c-family/c-omp.o c-family/c-opts.o c-family/c-pch.o c-family/c-ppoutput.o c-family/c-pragma.o c-family/c-pretty-print.o c-family/c-semantics.o c-family/c-ada-spec.o tree-mudflap.o i386-c.o default-c.o cc1plus-checksum.o libbackend.a main.o tree-browser.o libcommon-target.a libcommon.a ../libcpp/libcpp.a ../libdecnumber/libdecnumber.a libcommon.a ../libcpp/libcpp.a   ../libiberty/libiberty.a ../libdecnumber/libdecnumber.a   -lmpc -lmpfr -lgmp -rdynamic -ldl  -lz
/export/gnu/import/git/gcc-test-profile/bld/./prev-gcc/g++ -B/export/gnu/import/git/gcc-test-profile/bld/./prev-gcc/ -B/usr/local/x86_64-unknown-linux-gnu/bin/ -nostdinc++ -B/export/gnu/import/git/gcc-test-profile/bld/prev-x86_64-unknown-linux-gnu/libstdc++-v3/src/.libs -B/export/gnu/import/git/gcc-test-profile/bld/prev-x86_64-unknown-linux-gnu/libstdc++-v3/libsupc++/.libs -I/export/gnu/import/git/gcc-test-profile/bld/prev-x86_64-unknown-linux-gnu/libstdc++-v3/include/x86_64-unknown-linux-gnu -I/export/gnu/import/git/gcc-test-profile/bld/prev-x86_64-unknown-linux-gnu/libstdc++-v3/include -I/export/gnu/import/git/gcc-test-profile/src-trunk/libstdc++-v3/libsupc++ -L/export/gnu/import/git/gcc-test-profile/bld/prev-x86_64-unknown-linux-gnu/libstdc++-v3/src/.libs -L/export/gnu/import/git/gcc-test-profile/bld/prev-x86_64-unknown-linux-gnu/libstdc++-v3/libsupc++/.libs   -g -O2 -flto=jobserver -frandom-seed=1 -fprofile-use -DIN_GCC   -fno-exceptions -fno-rtti -W -Wall -Wno-narrowing -Wwrite-strings -Wcast-qual -Wmissing-format-attribute -pedantic -Wno-long-long -Wno-variadic-macros -Wno-overlength-strings -Werror -fno-common  -DHAVE_CONFIG_H -static-libstdc++ -static-libgcc  -o cc1obj \
      objc/objc-lang.o objc/objc-act.o objc/objc-runtime-shared-support.o objc/objc-gnu-runtime-abi-01.o objc/objc-next-runtime-abi-01.o objc/objc-next-runtime-abi-02.o objc/objc-encoding.o objc/objc-map.o attribs.o c/c-errors.o c/c-decl.o c/c-typeck.o c/c-convert.o c/c-aux-info.o c/c-objc-common.o c/c-parser.o c-family/c-common.o c-family/c-cppbuiltin.o c-family/c-dump.o c-family/c-format.o c-family/c-gimplify.o c-family/c-lex.o c-family/c-omp.o c-family/c-opts.o c-family/c-pch.o c-family/c-ppoutput.o c-family/c-pragma.o c-family/c-pretty-print.o c-family/c-semantics.o c-family/c-ada-spec.o tree-mudflap.o i386-c.o default-c.o cc1obj-checksum.o \
      libbackend.a main.o tree-browser.o libcommon-target.a libcommon.a ../libcpp/libcpp.a ../libdecnumber/libdecnumber.a libcommon.a ../libcpp/libcpp.a   ../libiberty/libiberty.a ../libdecnumber/libdecnumber.a   -lmpc -lmpfr -lgmp -rdynamic -ldl  -lz
make[7]: Entering directory `/export/gnu/import/git/gcc-test-profile/bld/prev-gcc'
(cd `${PWDCMD-pwd}`/include-fixed ; \
 tar -cf - .; exit 0) | (cd /export/gnu/import/git/gcc-test-profile/bld/prev-gcc/../gcc/./include-fixed; tar xpf - )
make[7]: Leaving directory `/export/gnu/import/git/gcc-test-profile/bld/prev-gcc'
echo timestamp > stmp-fixinc
if [ -d include ] ; then true; else mkdir include; chmod a+rx include; fi
if [ -d include-fixed ] ; then true; else mkdir include-fixed; chmod a+rx include-fixed; fi
for file in .. ../../src-trunk/gcc/ginclude/float.h ../../src-trunk/gcc/ginclude/iso646.h ../../src-trunk/gcc/ginclude/stdarg.h ../../src-trunk/gcc/ginclude/stdbool.h ../../src-trunk/gcc/ginclude/stddef.h ../../src-trunk/gcc/ginclude/varargs.h ../../src-trunk/gcc/ginclude/stdfix.h ../../src-trunk/gcc/ginclude/stdnoreturn.h ../../src-trunk/gcc/ginclude/stdalign.h ../../src-trunk/gcc/config/i386/cpuid.h ../../src-trunk/gcc/config/i386/mmintrin.h ../../src-trunk/gcc/config/i386/mm3dnow.h ../../src-trunk/gcc/config/i386/xmmintrin.h ../../src-trunk/gcc/config/i386/emmintrin.h ../../src-trunk/gcc/config/i386/pmmintrin.h ../../src-trunk/gcc/config/i386/tmmintrin.h ../../src-trunk/gcc/config/i386/ammintrin.h ../../src-trunk/gcc/config/i386/smmintrin.h ../../src-trunk/gcc/config/i386/nmmintrin.h ../../src-trunk/gcc/config/i386/bmmintrin.h ../../src-trunk/gcc/config/i386/fma4intrin.h ../../src-trunk/gcc/config/i386/wmmintrin.h ../../src-trunk/gcc/config/i386/immintrin.h ../../src-trunk/gcc/config/i386/x86intrin.h ../../src-trunk/gcc/config/i386/avxintrin.h ../../src-trunk/gcc/config/i386/xopintrin.h ../../src-trunk/gcc/config/i386/ia32intrin.h ../../src-trunk/gcc/config/i386/cross-stdarg.h ../../src-trunk/gcc/config/i386/lwpintrin.h ../../src-trunk/gcc/config/i386/popcntintrin.h ../../src-trunk/gcc/config/i386/lzcntintrin.h ../../src-trunk/gcc/config/i386/bmiintrin.h ../../src-trunk/gcc/config/i386/tbmintrin.h ../../src-trunk/gcc/config/i386/bmi2intrin.h ../../src-trunk/gcc/config/i386/avx2intrin.h ../../src-trunk/gcc/config/i386/fmaintrin.h ../../src-trunk/gcc/config/i386/f16cintrin.h ../../src-trunk/gcc/config/i386/rtmintrin.h ../../src-trunk/gcc/config/i386/xtestintrin.h mm_malloc.h; do \
  if [ X$file != X.. ]; then \
    realfile=`echo $file | sed -e 's|.*/\([^/]*\)$|\1|'`; \
    echo timestamp > include/$realfile; \
    rm -f include/$realfile; \
    cp $file include; \
    chmod a+r include/$realfile; \
  fi; \
done
for file in .. ; do \
  if [ X$file != X.. ]; then \
            mv include/$file include/x_$file; \
            echo "#include_next <$file>" >include/$file; \
            cat include/x_$file >>include/$file; \
            rm -f include/x_$file; \
    chmod a+r include/$file; \
  fi; \
done
for file in .. ; do \
  if [ X$file != X.. ]; then \
    echo "#include_next <$file>" >>include/$file; \
    chmod a+r include/$file; \
  fi; \
done
rm -f include/stdint.h
if [ wrap = wrap ]; then \
  rm -f include/stdint-gcc.h; \
  cp ../../src-trunk/gcc/ginclude/stdint-gcc.h include/stdint-gcc.h; \
  chmod a+r include/stdint-gcc.h; \
  cp ../../src-trunk/gcc/ginclude/stdint-wrap.h include/stdint.h; \
  chmod a+r include/stdint.h; \
elif [ wrap = provide ]; then \
  cp ../../src-trunk/gcc/ginclude/stdint-gcc.h include/stdint.h; \
  chmod a+r include/stdint.h; \
fi
set -e; for ml in `cat fixinc_list`; do \
  sysroot_headers_suffix=`echo ${ml} | sed -e 's/;.*$//'`; \
  multi_dir=`echo ${ml} | sed -e 's/^[^;]*;//'`; \
  fix_dir=include-fixed${multi_dir}; \
  if [ -f `echo /usr/include | sed -e :a -e 's,[^/]*/\.\.\/,,' -e ta`/limits.h ] ; then \
    cat ../../src-trunk/gcc/limitx.h ../../src-trunk/gcc/glimits.h ../../src-trunk/gcc/limity.h > tmp-xlimits.h; \
  else \
    cat ../../src-trunk/gcc/glimits.h > tmp-xlimits.h; \
  fi; \
  /bin/sh ../../src-trunk/gcc/../mkinstalldirs ${fix_dir}; \
  chmod a+rx ${fix_dir} || true; \
  /bin/sh ../../src-trunk/gcc/../move-if-change \
    tmp-xlimits.h  tmp-limits.h; \
  rm -f ${fix_dir}/limits.h; \
  cp -p tmp-limits.h ${fix_dir}/limits.h; \
  chmod a+r ${fix_dir}/limits.h; \
done
rm -f include-fixed/README
cp ../../src-trunk/gcc/../fixincludes/README-fixinc include-fixed/README
chmod a+r include-fixed/README
echo timestamp > stmp-int-hdrs
profiling:/export/gnu/import/git/gcc-test-profile/bld/gcc/insn-opinit.gcda:Invocation mismatch - some data files may have been removed
rm gcj-dbtool.pod jcf-dump.pod jv-convert.pod grmic.pod gcov.pod gcj.pod gc-analyze.pod gfdl.pod cpp.pod gij.pod gfortran.pod gcc.pod fsf-funding.pod
make[6]: Leaving directory `/export/gnu/import/git/gcc-test-profile/bld/gcc'
Checking multilib configuration for libgcc...
Configuring stage feedback in x86_64-unknown-linux-gnu/libgcc
configure: creating cache ./config.cache
checking build system type... x86_64-unknown-linux-gnu
checking host system type... x86_64-unknown-linux-gnu
checking for --enable-version-specific-runtime-libs... no
checking for a BSD-compatible install... /usr/bin/install -c
checking for gawk... gawk
checking for x86_64-unknown-linux-gnu-ar... /usr/local/x86_64-unknown-linux-gnu/bin/ar
checking for x86_64-unknown-linux-gnu-lipo... lipo
checking for x86_64-unknown-linux-gnu-nm... /export/gnu/import/git/gcc-test-profile/bld/./gcc/nm
checking for x86_64-unknown-linux-gnu-ranlib... /usr/local/x86_64-unknown-linux-gnu/bin/ranlib
checking for x86_64-unknown-linux-gnu-strip... /usr/local/x86_64-unknown-linux-gnu/bin/strip
checking whether ln -s works... yes
checking for x86_64-unknown-linux-gnu-gcc... /export/gnu/import/git/gcc-test-profile/bld/./gcc/xgcc -B/export/gnu/import/git/gcc-test-profile/bld/./gcc/ -B/usr/local/x86_64-unknown-linux-gnu/bin/ -B/usr/local/x86_64-unknown-linux-gnu/lib/ -isystem /usr/local/x86_64-unknown-linux-gnu/include -isystem /usr/local/x86_64-unknown-linux-gnu/sys-include   
checking for suffix of object files... configure: error: in `/export/gnu/import/git/gcc-test-profile/bld/x86_64-unknown-linux-gnu/libgcc':
configure: error: cannot compute suffix of object files: cannot compile
See `config.log' for more details.
make[5]: *** [configure-stagefeedback-target-libgcc] Error 1
make[5]: Leaving directory `/export/gnu/import/git/gcc-test-profile/bld'
make[4]: *** [stagefeedback-bubble] Error 2
make[4]: Leaving directory `/export/gnu/import/git/gcc-test-profile/bld'
make[3]: *** [profiledbootstrap] Error 2
make[3]: Leaving directory `/export/gnu/import/git/gcc-test-profile/bld'
19923.74user 729.39system 1:02:20elapsed 552%CPU (0avgtext+0avgdata 567004maxresident)k
2018216inputs+33492776outputs (11509major+143096372minor)pagefaults 0swaps
make[2]: *** [profiledbootstrap] Error 2
make[2]: Leaving directory `/export/gnu/import/git/gcc-test-profile'



More information about the Gcc-regression mailing list