Regressions on trunk at revision 183772 vs revision 183757

Kirill Yukhin [Intel64 Core i7 AVX] i64corei7avx@mailhost.ims.intel.com
Tue Jan 31 23:17:00 GMT 2012


New failures:
	flags=`echo $i | sed -e 's/^[^;]*;//'FAIL: linking TestClosureGC
	record_test FAIL $message
	record_test KFAIL $message
	record_test XFAIL $message
"catch "uplevel #0 soFAIL: ext/vstring/requirements/explicit_instantiation/char16_t/1.cc (test for excess errors)
"catch "uplevel #0 source $test_file_name""FAIL: ext/vstring/requirements/explicit_instantiation/char32_t/1.cc (test for excess errors)
"record_test FAIL $message"
./gen-classlist.sh: line 28: echo: write error: No space left on dFAIL: ext/vstring/requirements/explicit_instantiation/wchar_t/1.cc (test for excess errors)
FAIL: 21_strings/basic_string/requirements/explicit_instantiation/1.cc (test for excess errors)
FAIL: 21_strings/basic_string/requirements/explicit_instantiation/char/1.cc (test for excess errors)
FAIL: 21_strings/basic_string/requirements/explicit_instantiation/char16_t/1.cc (test for excess errors)
FAIL: 21_strings/basic_string/requirements/explicit_instantiation/char32_t/1.cc (test for excess errors)
FAIL: 21_strings/basic_string/requirements/explicit_instantiation/debug.cc (test for excess errors)
FAIL: 21_strings/basic_string/requirements/explicit_instantiation/wchar_t/1.cc (test for excess errors)
FAIL: ArrayStore -O3 -findirect-dispatch compilation from source
FAIL: ArrayStore -O3 -findirect-dispatch compilation from source
FAIL: ArrayStore -O3 compilation from source
FAIL: ArrayStore -O3 compilation from source
FAIL: ArrayStore -findirect-dispatch compilation from source
FAIL: ArrayStore -findirect-dispatch compilation from source
FAIL: ArrayStore compilation from source
FAIL: ArrayStore compilation from source
FAIL: ArrayStore2 -O3 -findirect-dispatch compilation from source
FAIL: ArrayStore2 -O3 -findirect-dispatch compilation from source
FAIL: ArrayStore2 -O3 compilation from source
FAIL: ArrayStore2 -O3 compilation from source
FAIL: ArrayStore2 -findirect-dispatch compilation from source
FAIL: ArrayStore2 -findirect-dispatch compilation from source
FAIL: ArrayStore2 compilation from source
FAIL: ArrayStore2 compilation from source
FAIL: Array_1 -O3 -findirect-dispatch compilation from source
FAIL: Array_1 -O3 compilation from source
FAIL: Array_1 -findirect-dispatch compilation from source
FAIL: Array_1 compilation from source
FAIL: Array_1 compilation from source
FAIL: Array_2 -findirect-dispatch compilation from source
FAIL: Array_2 compilation from source
FAIL: PR16923.c compilation
FAIL: PR18116.c compilation
FAIL: PR28178.c compilation
FAIL: bytebuffer.c compilation
FAIL: calls.c compilation
FAIL: compiling dummy JVMTI agent
FAIL: cxxtest.cc compilation
FAIL: directbuffer.c compilation
FAIL: dummyagent.c compilation
FAIL: ext/pb_ds/regression/tree_map_rand.cc (test for excess errors)
FAIL: ext/pb_ds/regression/tree_set_rand.cc (test for excess errors)
FAIL: ext/pb_ds/regression/trie_map_rand.cc (test for excess errors)
FAIL: ext/pb_ds/regression/trie_set_rand.cc (test for excess errors)
FAIL: ext/stdio_filebuf/requirements/explicit_instantiation.cc (test for excess errors)
FAIL: ext/vstring/operators/1.cc (test for excess errors)
FAIL: ext/vstring/requirements/exception/basic.cc (test for excess errors)
FAIL: ext/vstring/requirements/exception/generation_prohibited.cc (test for excess errors)
FAIL: ext/vstring/requirements/exception/propagation_consistent.cc (test for excess errors)
FAIL: ext/vstring/requirements/explicit_instantiation/1.cc (test for excess errors)
FAIL: ext/vstring/requirements/explicit_instantiation/2.cc (test for excess errors)
FAIL: ext/vstring/requirements/explicit_instantiation/char/1.cc (test for excess errors)
FAIL: field.c compilation
FAIL: final_method.c compilation
FAIL: findclass.c compilation
FAIL: findclass2.c compilation
FAIL: init.c compilation
FAIL: invoke.c compilation
FAIL: jniutf.c compilation
FAIL: libffi.call/closure_fn4.c -O2 (test for excess errors)
FAIL: libffi.call/closure_fn5.c -O2 (test for excess errors)
FAIL: libffi.call/closure_fn6.c -O2 (test for excess errors)
FAIL: libffi.call/cls_12byte.c -O0 -W -Wall (test for excess errors)
FAIL: libffi.call/cls_16byte.c -O0 -W -Wall (test for excess errors)
FAIL: libffi.call/cls_18byte.c -O0 -W -Wall (test for excess errors)
FAIL: libffi.call/cls_19byte.c -O0 -W -Wall (test for excess errors)
FAIL: libffi.call/cls_1_1byte.c -O0 -W -Wall (test for excess errors)
FAIL: libffi.call/cls_20byte.c -O0 -W -Wall (test for excess errors)
FAIL: libffi.call/cls_20byte1.c -O0 -W -Wall (test for excess errors)
FAIL: libffi.call/cls_24byte.c -O0 -W -Wall (test for excess errors)
FAIL: libffi.call/cls_2byte.c -O0 -W -Wall (test for excess errors)
FAIL: libffi.call/cls_3_1byte.c -O0 -W -Wall (test for excess errors)
FAIL: libffi.call/cls_3byte1.c -O0 -W -Wall (test for excess errors)
FAIL: libffi.call/cls_3byte2.c -O0 -W -Wall (test for excess errors)
FAIL: libffi.call/cls_64byte.c -O2 (test for excess errors)
FAIL: libffi.call/cls_6_1_byte.c -O2 (test for excess errors)
FAIL: libffi.call/cls_6byte.c -O2 (test for excess errors)
FAIL: libffi.call/cls_7_1_byte.c -O2 (test for excess errors)
FAIL: libffi.call/cls_7byte.c -O2 (test for excess errors)
FAIL: libffi.call/cls_8byte.c -O2 (test for excess errors)
FAIL: libffi.call/cls_9byte1.c -O2 (test for excess errors)
FAIL: libffi.call/cls_9byte2.c -O2 (test for excess errors)
FAIL: libffi.call/return_uc.c -O0 -W -Wall (test for excess errors)
FAIL: linking PR15133
FAIL: linking iface
FAIL: linking simple
FAIL: martin.c compilation
FAIL: noclass.c compilation
FAIL: overload.c compilation
FAIL: pr11951.c compilation
FAIL: pr18278.c compilation
FAIL: pr23739.c compilation
FAIL: pr29812.c compilation
FAIL: register.c compilation
FAIL: register2.c compilation
FAIL: simple_int.c compilation
FAIL: throwit.c compilation
FAIL: virtual.c compilation
ERROR: could not compile testsuite_abi.cc
ERROR: could not compile testsuite_abi.cc
ERROR: could not compile testsuite_character.cc
ERROR: error writing "file3": no space left on device
ERROR: error writing "file3": no space left on device
ERROR: error writing "file3": no space left on device
ERROR: error writing "file3": no space left on device
ERROR: remote_download to tRunning /nightly/gcc.svn/test-intel64corei7avx/gcc-build-trunk/src-trunk/libjava/testsuite/libjava.lang/lang.exp ...
ERROR: remote_download to target of /nightly/gcc.svn/test-intel64corei7avx/gcc-build-trunk/src-trunk/libstdc++-v3/testsuite/data/cin_unget-1.txt to cin_unget-1.txt: cp: writing `cin_unget-1.txt': No space left on device
ERROR: remote_download to target of /nightly/gcc.svn/test-intel64corei7avx/gcc-build-trunk/src-trunk/libstdc++-v3/testsuite/data/filebuf_virtuals-1.txt to filebuf_virtuals-1.txt: cp: writing `filebuf_virtuals-1.txt': No space left on device
ERROR: remote_download to target of /nightly/gcc.svn/test-intel64corei7avx/gcc-build-trunk/src-trunk/libstdc++-v3/testsuite/data/ostream_inserter_char-1.txt to ostream_inserter_char-1.txt: cp: writing `ostream_inserter_char-1.txt': No space left on device
ERROR: remote_download to target of /nightly/gcc.svn/test-intel64corei7avx/gcc-build-trunk/src-trunk/libstdc++-v3/testsuite/data/seekpos.txt to seekpos.txt: cp: writing `seekpos.txt': No space left on device
ERROR: remote_download to target of /nightly/gcc.svn/test-intel64corei7avx/gcc-build-trunk/src-trunk/libstdc++-v3/testsuite/data/thirty_years_among_the_dead_preproc.txt to thirty_years_among_the_dead_preproc.txt: cp: writing `thirty_years_among_the_dead_preproc.txt': No space left on device
ERROR: tcl error sourcing /nightly/gcc.svn/test-intel64corei7avx/gcc-build-trunk/src-trunk/libffi/testsuite/libffi.call/call.exp.
ERROR: tcl error sourcing /nightly/gcc.svn/test-intel64corei7avx/gcc-build-trunk/src-trunk/libffi/testsuite/libffi.call/call.exp.
ERROR: tcl error sourcing /nightly/gcc.svn/test-intel64corei7avx/gcc-build-trunk/src-trunk/libjava/testsuite/libjava.jvmti/jvmti.exp.
ERROR: tcl error sourcing /nightly/gcc.svn/test-intel64corei7avx/gcc-build-trunk/src-trunk/libjava/testsuite/libjava.lang/lang.exp.
ERROR: tcl error sourcing /nightly/gcc.svn/test-intel64corei7avx/gcc-build-trunk/src-trunk/libstdc++-v3/testsuite/libstdc++-dg/conformance.exp.
ERROR: tcl error sourcing /nightly/gcc.svn/test-intel64corei7avx/gcc-build-trunk/src-trunk/libstdc++-v3/testsuite/libstdc++-dg/conformance.exp.
ERROR: tcl error sourcing /nightly/gcc.svn/test-intel64corei7avx/gcc-build-trunk/src-trunk/libstdc++-v3/testsuite/libstdc++-dg/conformance.exp.

New passes:
FAIL: 22_locale/messages/members/char/1.cc execution test
FAIL: 22_locale/messages/members/char/1.cc execution test
FAIL: 22_locale/messages/members/char/2.cc execution test
FAIL: 22_locale/messages/members/char/2.cc execution test
FAIL: 22_locale/messages/members/char/wrapped_env.cc execution test
FAIL: 22_locale/messages/members/char/wrapped_env.cc execution test
FAIL: 22_locale/messages/members/char/wrapped_locale.cc execution test
FAIL: 22_locale/messages/members/char/wrapped_locale.cc execution test
FAIL: 22_locale/messages_byname/named_equivalence.cc execution test
FAIL: 22_locale/messages_byname/named_equivalence.cc execution test
FAIL: boehm-gc.c/thread_leak_test.c -O2 (test for excess errors)
FAIL: boehm-gc.c/thread_leak_test.c -O2 (test for excess errors)



More information about the Gcc-regression mailing list