Gcc [trunk revision 181856] failed to profiledbootstrap on x86_64!

H.J. Lu Intel64 LTO/FDO intel64profiled@gnu-16.sc.intel.com
Wed Nov 30 20:42:00 GMT 2011


cd bld; \
 RUNTESTFLAGS="--target_board='unix{-m32,}'" ../src-trunk/configure \
	 --prefix=/usr/local --enable-clocale=gnu --with-system-zlib --enable-shared --with-demangler-in-ld --with-build-config=bootstrap-lto --with-fpmath=sse --enable-languages=c,c++,fortran,java,lto,objc
checking build system type... x86_64-unknown-linux-gnu
checking host system type... x86_64-unknown-linux-gnu
checking target system type... x86_64-unknown-linux-gnu
checking for a BSD-compatible install... /usr/bin/install -c
    grep "Error " makelog.181856.trunk.x86_64 >> makelog.181856.trunk.x86_64.mail; \
make[7]: *** [/tmp/ccqlIR1N.ltrans1.ltrans.o] Error 1
make[6]: *** [cc1obj] Error 1
make[7]: *** [/tmp/ccxjaV9M.ltrans29.ltrans.o] Error 1
make[6]: *** [cc1] Error 1
make[7]: *** [/tmp/ccAtlMNv.ltrans29.ltrans.o] Error 1
make[6]: *** [f951] Error 1
make[5]: *** [all-stagefeedback-gcc] Error 2
make[4]: *** [stagefeedback-bubble] Error 2
make[3]: *** [profiledbootstrap] Error 2
make[2]: *** [profiledbootstrap] Error 2
/export/gnu/import/svn/gcc-test-profile/bld/./prev-gcc/g++ -B/export/gnu/import/svn/gcc-test-profile/bld/./prev-gcc/ -B/usr/local/x86_64-unknown-linux-gnu/bin/ -nostdinc++ -B/export/gnu/import/svn/gcc-test-profile/bld/prev-x86_64-unknown-linux-gnu/libstdc++-v3/src/.libs -B/export/gnu/import/svn/gcc-test-profile/bld/prev-x86_64-unknown-linux-gnu/libstdc++-v3/libsupc++/.libs -I/export/gnu/import/svn/gcc-test-profile/bld/prev-x86_64-unknown-linux-gnu/libstdc++-v3/include/x86_64-unknown-linux-gnu -I/export/gnu/import/svn/gcc-test-profile/bld/prev-x86_64-unknown-linux-gnu/libstdc++-v3/include -I/export/gnu/import/svn/gcc-test-profile/src-trunk/libstdc++-v3/libsupc++ -L/export/gnu/import/svn/gcc-test-profile/bld/prev-x86_64-unknown-linux-gnu/libstdc++-v3/src/.libs -L/export/gnu/import/svn/gcc-test-profile/bld/prev-x86_64-unknown-linux-gnu/libstdc++-v3/libsupc++/.libs   -g -O2 -flto=jobserver -frandom-seed=1 -fprofile-use -DIN_GCC   -fno-exceptions -fno-rtti -W -Wall -Wno-narrowing -Wwrite-strings -Wcast-qual -Wmissing-format-attribute -pedantic -Wno-long-long -Wno-variadic-macros -Wno-overlength-strings -Werror -fno-common  -DHAVE_CONFIG_H -static-libstdc++ -static-libgcc  gcc-ranlib.o -o gcc-ranlib \
	libcommon.a ../libcpp/libcpp.a   ../libiberty/libiberty.a ../libdecnumber/libdecnumber.a  
/export/gnu/import/svn/gcc-test-profile/bld/./prev-gcc/g++ -B/export/gnu/import/svn/gcc-test-profile/bld/./prev-gcc/ -B/usr/local/x86_64-unknown-linux-gnu/bin/ -nostdinc++ -B/export/gnu/import/svn/gcc-test-profile/bld/prev-x86_64-unknown-linux-gnu/libstdc++-v3/src/.libs -B/export/gnu/import/svn/gcc-test-profile/bld/prev-x86_64-unknown-linux-gnu/libstdc++-v3/libsupc++/.libs -I/export/gnu/import/svn/gcc-test-profile/bld/prev-x86_64-unknown-linux-gnu/libstdc++-v3/include/x86_64-unknown-linux-gnu -I/export/gnu/import/svn/gcc-test-profile/bld/prev-x86_64-unknown-linux-gnu/libstdc++-v3/include -I/export/gnu/import/svn/gcc-test-profile/src-trunk/libstdc++-v3/libsupc++ -L/export/gnu/import/svn/gcc-test-profile/bld/prev-x86_64-unknown-linux-gnu/libstdc++-v3/src/.libs -L/export/gnu/import/svn/gcc-test-profile/bld/prev-x86_64-unknown-linux-gnu/libstdc++-v3/libsupc++/.libs   -g -O2 -flto=jobserver -frandom-seed=1 -fprofile-use -DIN_GCC   -fno-exceptions -fno-rtti -W -Wall -Wno-narrowing -Wwrite-strings -Wcast-qual -Wmissing-format-attribute -pedantic -Wno-long-long -Wno-variadic-macros -Wno-overlength-strings -Werror -fno-common  -DHAVE_CONFIG_H -static-libstdc++ -static-libgcc  -o gengtype \
    gengtype.o gengtype-lex.o gengtype-parse.o gengtype-state.o version.o errors.o libcommon.a ../libcpp/libcpp.a ../libiberty/libiberty.a ../libdecnumber/libdecnumber.a libcommon.a ../libcpp/libcpp.a   ../libiberty/libiberty.a ../libdecnumber/libdecnumber.a 
/export/gnu/import/svn/gcc-test-profile/bld/./prev-gcc/g++ -B/export/gnu/import/svn/gcc-test-profile/bld/./prev-gcc/ -B/usr/local/x86_64-unknown-linux-gnu/bin/ -nostdinc++ -B/export/gnu/import/svn/gcc-test-profile/bld/prev-x86_64-unknown-linux-gnu/libstdc++-v3/src/.libs -B/export/gnu/import/svn/gcc-test-profile/bld/prev-x86_64-unknown-linux-gnu/libstdc++-v3/libsupc++/.libs -I/export/gnu/import/svn/gcc-test-profile/bld/prev-x86_64-unknown-linux-gnu/libstdc++-v3/include/x86_64-unknown-linux-gnu -I/export/gnu/import/svn/gcc-test-profile/bld/prev-x86_64-unknown-linux-gnu/libstdc++-v3/include -I/export/gnu/import/svn/gcc-test-profile/src-trunk/libstdc++-v3/libsupc++ -L/export/gnu/import/svn/gcc-test-profile/bld/prev-x86_64-unknown-linux-gnu/libstdc++-v3/src/.libs -L/export/gnu/import/svn/gcc-test-profile/bld/prev-x86_64-unknown-linux-gnu/libstdc++-v3/libsupc++/.libs   -g -O2 -flto=jobserver -frandom-seed=1 -fprofile-use -DIN_GCC   -fno-exceptions -fno-rtti -W -Wall -Wno-narrowing -Wwrite-strings -Wcast-qual -Wmissing-format-attribute -pedantic -Wno-long-long -Wno-variadic-macros -Wno-overlength-strings -Werror -fno-common  -DHAVE_CONFIG_H -static-libstdc++ -static-libgcc  -o xgcc gcc.o ggc-none.o \
  gccspec.o driver-i386.o  libcommon-target.a \
   libcommon.a ../libcpp/libcpp.a   ../libiberty/libiberty.a ../libdecnumber/libdecnumber.a 
mv -f Tlto-wrapper lto-wrapper
/export/gnu/import/svn/gcc-test-profile/bld/./prev-gcc/g++ -B/export/gnu/import/svn/gcc-test-profile/bld/./prev-gcc/ -B/usr/local/x86_64-unknown-linux-gnu/bin/ -nostdinc++ -B/export/gnu/import/svn/gcc-test-profile/bld/prev-x86_64-unknown-linux-gnu/libstdc++-v3/src/.libs -B/export/gnu/import/svn/gcc-test-profile/bld/prev-x86_64-unknown-linux-gnu/libstdc++-v3/libsupc++/.libs -I/export/gnu/import/svn/gcc-test-profile/bld/prev-x86_64-unknown-linux-gnu/libstdc++-v3/include/x86_64-unknown-linux-gnu -I/export/gnu/import/svn/gcc-test-profile/bld/prev-x86_64-unknown-linux-gnu/libstdc++-v3/include -I/export/gnu/import/svn/gcc-test-profile/src-trunk/libstdc++-v3/libsupc++ -L/export/gnu/import/svn/gcc-test-profile/bld/prev-x86_64-unknown-linux-gnu/libstdc++-v3/src/.libs -L/export/gnu/import/svn/gcc-test-profile/bld/prev-x86_64-unknown-linux-gnu/libstdc++-v3/libsupc++/.libs   -g -O2 -flto=jobserver -frandom-seed=1 -fprofile-use -DIN_GCC   -fno-exceptions -fno-rtti -W -Wall -Wno-narrowing -Wwrite-strings -Wcast-qual -Wmissing-format-attribute -pedantic -Wno-long-long -Wno-variadic-macros -Wno-overlength-strings -Werror -fno-common  -DHAVE_CONFIG_H -static-libstdc++ -static-libgcc  -o cpp gcc.o ggc-none.o \
  cppspec.o driver-i386.o  libcommon-target.a \
   libcommon.a ../libcpp/libcpp.a   ../libiberty/libiberty.a ../libdecnumber/libdecnumber.a 
/export/gnu/import/svn/gcc-test-profile/bld/./prev-gcc/g++ -B/export/gnu/import/svn/gcc-test-profile/bld/./prev-gcc/ -B/usr/local/x86_64-unknown-linux-gnu/bin/ -nostdinc++ -B/export/gnu/import/svn/gcc-test-profile/bld/prev-x86_64-unknown-linux-gnu/libstdc++-v3/src/.libs -B/export/gnu/import/svn/gcc-test-profile/bld/prev-x86_64-unknown-linux-gnu/libstdc++-v3/libsupc++/.libs -I/export/gnu/import/svn/gcc-test-profile/bld/prev-x86_64-unknown-linux-gnu/libstdc++-v3/include/x86_64-unknown-linux-gnu -I/export/gnu/import/svn/gcc-test-profile/bld/prev-x86_64-unknown-linux-gnu/libstdc++-v3/include -I/export/gnu/import/svn/gcc-test-profile/src-trunk/libstdc++-v3/libsupc++ -L/export/gnu/import/svn/gcc-test-profile/bld/prev-x86_64-unknown-linux-gnu/libstdc++-v3/src/.libs -L/export/gnu/import/svn/gcc-test-profile/bld/prev-x86_64-unknown-linux-gnu/libstdc++-v3/libsupc++/.libs   -g -O2 -flto=jobserver -frandom-seed=1 -fprofile-use -DIN_GCC   -fno-exceptions -fno-rtti -W -Wall -Wno-narrowing -Wwrite-strings -Wcast-qual -Wmissing-format-attribute -pedantic -Wno-long-long -Wno-variadic-macros -Wno-overlength-strings -Werror -fno-common  -DHAVE_CONFIG_H -static-libstdc++ -static-libgcc  -o g++ \
  gcc.o ggc-none.o g++spec.o driver-i386.o  libcommon-target.a \
   libcommon.a ../libcpp/libcpp.a   ../libiberty/libiberty.a ../libdecnumber/libdecnumber.a 
/export/gnu/import/svn/gcc-test-profile/bld/./prev-gcc/g++ -B/export/gnu/import/svn/gcc-test-profile/bld/./prev-gcc/ -B/usr/local/x86_64-unknown-linux-gnu/bin/ -nostdinc++ -B/export/gnu/import/svn/gcc-test-profile/bld/prev-x86_64-unknown-linux-gnu/libstdc++-v3/src/.libs -B/export/gnu/import/svn/gcc-test-profile/bld/prev-x86_64-unknown-linux-gnu/libstdc++-v3/libsupc++/.libs -I/export/gnu/import/svn/gcc-test-profile/bld/prev-x86_64-unknown-linux-gnu/libstdc++-v3/include/x86_64-unknown-linux-gnu -I/export/gnu/import/svn/gcc-test-profile/bld/prev-x86_64-unknown-linux-gnu/libstdc++-v3/include -I/export/gnu/import/svn/gcc-test-profile/src-trunk/libstdc++-v3/libsupc++ -L/export/gnu/import/svn/gcc-test-profile/bld/prev-x86_64-unknown-linux-gnu/libstdc++-v3/src/.libs -L/export/gnu/import/svn/gcc-test-profile/bld/prev-x86_64-unknown-linux-gnu/libstdc++-v3/libsupc++/.libs   -g -O2 -flto=jobserver -frandom-seed=1 -fprofile-use -DIN_GCC   -fno-exceptions -fno-rtti -W -Wall -Wno-narrowing -Wwrite-strings -Wcast-qual -Wmissing-format-attribute -pedantic -Wno-long-long -Wno-variadic-macros -Wno-overlength-strings -Werror -fno-common  -DHAVE_CONFIG_H -static-libstdc++ -static-libgcc  -o gfortran \
  gcc.o ggc-none.o gfortranspec.o driver-i386.o  libcommon-target.a \
   libcommon.a ../libcpp/libcpp.a   ../libiberty/libiberty.a ../libdecnumber/libdecnumber.a 
profiling:/export/gnu/import/svn/gcc-test-profile/bld/libiberty/splay-tree.gcda:Invocation mismatch - some data files may have been removed
mv -f Tcollect2 collect2
/export/gnu/import/svn/gcc-test-profile/bld/./gcc/xgcc -B/export/gnu/import/svn/gcc-test-profile/bld/./gcc/ -dumpspecs > tmp-specs
mv tmp-specs specs
: > tmp-libgcc.mvars
echo GCC_CFLAGS = '-g -O2 -DIN_GCC   -W -Wall -Wno-narrowing -Wwrite-strings -Wcast-qual -Wstrict-prototypes -Wmissing-prototypes -Wold-style-definition  -isystem ./include ' >> tmp-libgcc.mvars
echo INHIBIT_LIBC_CFLAGS = '' >> tmp-libgcc.mvars
echo TARGET_SYSTEM_ROOT = '' >> tmp-libgcc.mvars
mv tmp-libgcc.mvars libgcc.mvars
profiling:/export/gnu/import/svn/gcc-test-profile/bld/gcc/tree-ssa-threadupdate.gcda:Invocation mismatch - some data files may have been removed
rm -rf libbackend.a
ar rc libbackend.a insn-attrtab.o insn-automata.o insn-emit.o insn-extract.o insn-modes.o insn-opinit.o insn-output.o insn-peep.o insn-preds.o insn-recog.o insn-enums.o ggc-page.o alias.o alloc-pool.o auto-inc-dec.o bb-reorder.o bitmap.o bt-load.o builtins.o caller-save.o calls.o cfg.o cfganal.o cfgbuild.o cfgcleanup.o cfgexpand.o cfghooks.o cfglayout.o cfgloop.o cfgloopanal.o cfgloopmanip.o cfgrtl.o cgraph.o cgraphbuild.o cgraphunit.o combine.o combine-stack-adj.o compare-elim.o convert.o coverage.o cppbuiltin.o cppdefault.o cprop.o cse.o cselib.o data-streamer.o data-streamer-in.o data-streamer-out.o dbxout.o dbgcnt.o dce.o ddg.o debug.o df-core.o df-problems.o df-scan.o dfp.o dojump.o dominance.o domwalk.o double-int.o dse.o dwarf2asm.o dwarf2cfi.o dwarf2out.o ebitmap.o emit-rtl.o et-forest.o except.o explow.o expmed.o expr.o final.o fixed-value.o fold-const.o function.o fwprop.o gcse.o ggc-common.o gimple.o gimple-iterator.o gimple-fold.o gimple-low.o gimple-pretty-print.o gimple-streamer-in.o gimple-streamer-out.o gimplify.o godump.o graph.o graphds.o graphite.o graphite-blocking.o graphite-clast-to-gimple.o graphite-cloog-util.o graphite-dependences.o graphite-flattening.o graphite-interchange.o graphite-poly.o graphite-ppl.o graphite-scop-detection.o graphite-sese-to-poly.o gtype-desc.o haifa-sched.o hw-doloop.o hwint.o ifcvt.o implicit-zee.o incpath.o init-regs.o integrate.o internal-fn.o ipa-cp.o ipa-split.o ipa-inline.o ipa-inline-analysis.o ipa-inline-transform.o ipa-prop.o ipa-pure-const.o ipa-reference.o ipa-ref.o ipa-utils.o ipa.o ira.o ira-build.o ira-costs.o ira-conflicts.o ira-color.o ira-emit.o ira-lives.o jump.o langhooks.o lcm.o lists.o loop-doloop.o loop-init.o loop-invariant.o loop-iv.o loop-unroll.o loop-unswitch.o lower-subreg.o lto-cgraph.o lto-streamer.o lto-streamer-in.o lto-streamer-out.o lto-section-in.o lto-section-out.o lto-symtab.o lto-opts.o lto-compress.o matrix-reorg.o mcf.o mode-switching.o modulo-sched.o omega.o omp-low.o optabs.o options-save.o opts-global.o passes.o plugin.o pointer-set.o postreload-gcse.o postreload.o predict.o print-rtl.o print-tree.o profile.o real.o realmpfr.o recog.o reg-stack.o regcprop.o reginfo.o regmove.o regrename.o regstat.o reload.o reload1.o reorg.o resource.o rtl-error.o rtl.o rtlanal.o rtlhooks.o sbitmap.o sched-deps.o sched-ebb.o sched-rgn.o sched-vis.o sdbout.o sel-sched-ir.o sel-sched-dump.o sel-sched.o sese.o simplify-rtx.o sparseset.o sreal.o stack-ptr-mod.o statistics.o stmt.o stor-layout.o store-motion.o streamer-hooks.o stringpool.o target-globals.o targhooks.o timevar.o toplev.o tracer.o trans-mem.o tree-affine.o tree-call-cdce.o tree-cfg.o tree-cfgcleanup.o tree-chrec.o tree-complex.o tree-data-ref.o tree-dfa.o tree-diagnostic.o tree-dump.o tree-eh.o tree-emutls.o tree-if-conv.o tree-inline.o tree-into-ssa.o tree-iterator.o tree-loop-distribution.o tree-nested.o tree-nomudflap.o tree-nrv.o tree-object-size.o tree-optimize.o tree-outof-ssa.o tree-parloops.o tree-phinodes.o tree-predcom.o tree-pretty-print.o tree-profile.o tree-scalar-evolution.o tree-sra.o tree-switch-conversion.o tree-ssa-address.o tree-ssa-alias.o tree-ssa-ccp.o tree-ssa-coalesce.o tree-ssa-copy.o tree-ssa-copyrename.o tree-ssa-dce.o tree-ssa-dom.o tree-ssa-dse.o tree-ssa-forwprop.o tree-ssa-ifcombine.o tree-ssa-live.o tree-ssa-loop-ch.o tree-ssa-loop-im.o tree-ssa-loop-ivcanon.o tree-ssa-loop-ivopts.o tree-ssa-loop-manip.o tree-ssa-loop-niter.o tree-ssa-loop-prefetch.o tree-ssa-loop-unswitch.o tree-ssa-loop.o tree-ssa-math-opts.o tree-ssa-operands.o tree-ssa-phiopt.o tree-ssa-phiprop.o tree-ssa-pre.o tree-ssa-propagate.o tree-ssa-reassoc.o tree-ssa-sccvn.o tree-ssa-sink.o tree-ssa-strlen.o tree-ssa-structalias.o tree-ssa-tail-merge.o tree-ssa-ter.o tree-ssa-threadedge.o tree-ssa-threadupdate.o tree-ssa-uncprop.o tree-ssa-uninit.o tree-ssa.o tree-ssanames.o tree-stdarg.o tree-streamer.o tree-streamer-in.o tree-streamer-out.o tree-tailcall.o tree-vect-generic.o tree-vect-patterns.o tree-vect-data-refs.o tree-vect-stmts.o tree-vect-loop.o tree-vect-loop-manip.o tree-vect-slp.o tree-vectorizer.o tree-vrp.o tree.o value-prof.o var-tracking.o varasm.o varpool.o vmsdbgout.o web.o xcoffout.o i386.o  host-linux.o
ranlib  libbackend.a
build/genchecksum c-lang.o c-family/stub-objc.o attribs.o c-errors.o c-decl.o c-typeck.o c-convert.o c-aux-info.o c-objc-common.o c-parser.o tree-mudflap.o c-family/c-common.o c-family/c-cppbuiltin.o c-family/c-dump.o c-family/c-format.o c-family/c-gimplify.o c-family/c-lex.o c-family/c-omp.o c-family/c-opts.o c-family/c-pch.o c-family/c-ppoutput.o c-family/c-pragma.o c-family/c-pretty-print.o c-family/c-semantics.o c-family/c-ada-spec.o i386-c.o default-c.o main.o tree-browser.o libbackend.a libcommon-target.a libcommon.a ../libcpp/libcpp.a ../libdecnumber/libdecnumber.a libcommon.a ../libcpp/libcpp.a ../libiberty/libiberty.a   ../libdecnumber/libdecnumber.a \
                     checksum-options > cc1-checksum.c.tmp && 		 \
../../src-trunk/gcc/../move-if-change cc1-checksum.c.tmp cc1-checksum.c
build/genchecksum cp/cp-lang.o c-family/stub-objc.o cp/call.o cp/decl.o cp/expr.o cp/pt.o cp/typeck2.o cp/class.o cp/decl2.o cp/error.o cp/lex.o cp/parser.o cp/ptree.o cp/rtti.o cp/typeck.o cp/cvt.o cp/except.o cp/friend.o cp/init.o cp/method.o cp/search.o cp/semantics.o cp/tree.o cp/repo.o cp/dump.o cp/optimize.o cp/mangle.o cp/cp-objcp-common.o cp/name-lookup.o cp/cxx-pretty-print.o cp/cp-gimplify.o tree-mudflap.o attribs.o incpath.o c-family/c-common.o c-family/c-cppbuiltin.o c-family/c-dump.o c-family/c-format.o c-family/c-gimplify.o c-family/c-lex.o c-family/c-omp.o c-family/c-opts.o c-family/c-pch.o c-family/c-ppoutput.o c-family/c-pragma.o c-family/c-pretty-print.o c-family/c-semantics.o c-family/c-ada-spec.o i386-c.o default-c.o main.o tree-browser.o libbackend.a libcommon-target.a libcommon.a ../libcpp/libcpp.a ../libdecnumber/libdecnumber.a libcommon.a ../libcpp/libcpp.a ../libiberty/libiberty.a   ../libdecnumber/libdecnumber.a \
                     checksum-options > cc1plus-checksum.c.tmp &&	   \
../../src-trunk/gcc/../move-if-change cc1plus-checksum.c.tmp cc1plus-checksum.c
/export/gnu/import/svn/gcc-test-profile/bld/./prev-gcc/g++ -B/export/gnu/import/svn/gcc-test-profile/bld/./prev-gcc/ -B/usr/local/x86_64-unknown-linux-gnu/bin/ -nostdinc++ -B/export/gnu/import/svn/gcc-test-profile/bld/prev-x86_64-unknown-linux-gnu/libstdc++-v3/src/.libs -B/export/gnu/import/svn/gcc-test-profile/bld/prev-x86_64-unknown-linux-gnu/libstdc++-v3/libsupc++/.libs -I/export/gnu/import/svn/gcc-test-profile/bld/prev-x86_64-unknown-linux-gnu/libstdc++-v3/include/x86_64-unknown-linux-gnu -I/export/gnu/import/svn/gcc-test-profile/bld/prev-x86_64-unknown-linux-gnu/libstdc++-v3/include -I/export/gnu/import/svn/gcc-test-profile/src-trunk/libstdc++-v3/libsupc++ -L/export/gnu/import/svn/gcc-test-profile/bld/prev-x86_64-unknown-linux-gnu/libstdc++-v3/src/.libs -L/export/gnu/import/svn/gcc-test-profile/bld/prev-x86_64-unknown-linux-gnu/libstdc++-v3/libsupc++/.libs   -g -O2 -flto=jobserver -frandom-seed=1 -fprofile-use -DIN_GCC   -fno-exceptions -fno-rtti -W -Wall -Wno-narrowing -Wwrite-strings -Wcast-qual -Wmissing-format-attribute -pedantic -Wno-long-long -Wno-variadic-macros -Wno-overlength-strings -Werror -fno-common  -DHAVE_CONFIG_H -static-libstdc++ -static-libgcc  -o f951 \
	fortran/arith.o fortran/array.o fortran/bbt.o fortran/check.o fortran/class.o fortran/constructor.o fortran/cpp.o fortran/data.o fortran/decl.o fortran/dump-parse-tree.o fortran/error.o fortran/expr.o fortran/interface.o fortran/intrinsic.o fortran/io.o fortran/iresolve.o fortran/match.o fortran/matchexp.o fortran/misc.o fortran/module.o fortran/openmp.o fortran/options.o fortran/parse.o fortran/primary.o fortran/resolve.o fortran/scanner.o fortran/simplify.o fortran/st.o fortran/symbol.o fortran/target-memory.o  fortran/convert.o fortran/dependency.o fortran/f95-lang.o fortran/trans.o fortran/trans-array.o fortran/trans-common.o fortran/trans-const.o fortran/trans-decl.o fortran/trans-expr.o fortran/trans-intrinsic.o fortran/trans-io.o fortran/trans-openmp.o fortran/trans-stmt.o fortran/trans-types.o fortran/frontend-passes.o main.o tree-browser.o libbackend.a libcommon-target.a libcommon.a ../libcpp/libcpp.a ../libdecnumber/libdecnumber.a libcommon.a ../libcpp/libcpp.a   ../libiberty/libiberty.a ../libdecnumber/libdecnumber.a  attribs.o -lcloog -lppl_c -lppl  -lgmpxx -lmpc -lmpfr -lgmp -rdynamic -ldl  -lz
rm -f jc1
build/genchecksum objc/objc-lang.o objc/objc-act.o objc/objc-runtime-shared-support.o objc/objc-gnu-runtime-abi-01.o objc/objc-next-runtime-abi-01.o objc/objc-next-runtime-abi-02.o objc/objc-encoding.o objc/objc-map.o attribs.o c-errors.o c-decl.o c-typeck.o c-convert.o c-aux-info.o c-objc-common.o c-parser.o tree-mudflap.o c-family/c-common.o c-family/c-cppbuiltin.o c-family/c-dump.o c-family/c-format.o c-family/c-gimplify.o c-family/c-lex.o c-family/c-omp.o c-family/c-opts.o c-family/c-pch.o c-family/c-ppoutput.o c-family/c-pragma.o c-family/c-pretty-print.o c-family/c-semantics.o c-family/c-ada-spec.o i386-c.o default-c.o \
        main.o tree-browser.o libbackend.a libcommon-target.a libcommon.a ../libcpp/libcpp.a ../libdecnumber/libdecnumber.a libcommon.a ../libcpp/libcpp.a ../libiberty/libiberty.a   ../libdecnumber/libdecnumber.a checksum-options > cc1obj-checksum.c.tmp && \
../../src-trunk/gcc/../move-if-change cc1obj-checksum.c.tmp cc1obj-checksum.c
/export/gnu/import/svn/gcc-test-profile/bld/./prev-gcc/g++ -B/export/gnu/import/svn/gcc-test-profile/bld/./prev-gcc/ -B/usr/local/x86_64-unknown-linux-gnu/bin/ -nostdinc++ -B/export/gnu/import/svn/gcc-test-profile/bld/prev-x86_64-unknown-linux-gnu/libstdc++-v3/src/.libs -B/export/gnu/import/svn/gcc-test-profile/bld/prev-x86_64-unknown-linux-gnu/libstdc++-v3/libsupc++/.libs -I/export/gnu/import/svn/gcc-test-profile/bld/prev-x86_64-unknown-linux-gnu/libstdc++-v3/include/x86_64-unknown-linux-gnu -I/export/gnu/import/svn/gcc-test-profile/bld/prev-x86_64-unknown-linux-gnu/libstdc++-v3/include -I/export/gnu/import/svn/gcc-test-profile/src-trunk/libstdc++-v3/libsupc++ -L/export/gnu/import/svn/gcc-test-profile/bld/prev-x86_64-unknown-linux-gnu/libstdc++-v3/src/.libs -L/export/gnu/import/svn/gcc-test-profile/bld/prev-x86_64-unknown-linux-gnu/libstdc++-v3/libsupc++/.libs   -g -O2 -flto=jobserver -frandom-seed=1 -fprofile-use -DIN_GCC   -fno-exceptions -fno-rtti -W -Wall -Wno-narrowing -Wwrite-strings -Wcast-qual -Wmissing-format-attribute -pedantic -Wno-long-long -Wno-variadic-macros -Wno-overlength-strings -Werror -fno-common  -DHAVE_CONFIG_H -static-libstdc++ -static-libgcc  -o lto1 \
	lto/lto-lang.o lto/lto.o lto/lto-object.o attribs.o main.o tree-browser.o libbackend.a libcommon-target.a libcommon.a ../libcpp/libcpp.a ../libdecnumber/libdecnumber.a -lcloog -lppl_c -lppl  -lgmpxx -lmpc -lmpfr -lgmp -rdynamic -ldl  -lz libcommon.a ../libcpp/libcpp.a   ../libiberty/libiberty.a ../libdecnumber/libdecnumber.a 
/export/gnu/import/svn/gcc-test-profile/bld/./prev-gcc/g++ -B/export/gnu/import/svn/gcc-test-profile/bld/./prev-gcc/ -B/usr/local/x86_64-unknown-linux-gnu/bin/ -nostdinc++ -B/export/gnu/import/svn/gcc-test-profile/bld/prev-x86_64-unknown-linux-gnu/libstdc++-v3/src/.libs -B/export/gnu/import/svn/gcc-test-profile/bld/prev-x86_64-unknown-linux-gnu/libstdc++-v3/libsupc++/.libs -I/export/gnu/import/svn/gcc-test-profile/bld/prev-x86_64-unknown-linux-gnu/libstdc++-v3/include/x86_64-unknown-linux-gnu -I/export/gnu/import/svn/gcc-test-profile/bld/prev-x86_64-unknown-linux-gnu/libstdc++-v3/include -I/export/gnu/import/svn/gcc-test-profile/src-trunk/libstdc++-v3/libsupc++ -L/export/gnu/import/svn/gcc-test-profile/bld/prev-x86_64-unknown-linux-gnu/libstdc++-v3/src/.libs -L/export/gnu/import/svn/gcc-test-profile/bld/prev-x86_64-unknown-linux-gnu/libstdc++-v3/libsupc++/.libs   -g -O2 -flto=jobserver -frandom-seed=1 -fprofile-use -DIN_GCC   -fno-exceptions -fno-rtti -W -Wall -Wno-narrowing -Wwrite-strings -Wcast-qual -Wmissing-format-attribute -pedantic -Wno-long-long -Wno-variadic-macros -Wno-overlength-strings -Werror -fno-common  -DHAVE_CONFIG_H -static-libstdc++ -static-libgcc  -o jc1 \
	java/class.o java/decl.o java/expr.o java/constants.o java/lang.o java/typeck.o java/except.o java/verify-glue.o java/verify-impl.o java/zextract.o java/jcf-io.o java/win32-host.o java/jcf-parse.o java/mangle.o java/mangle_name.o java/builtins.o java/resource.o java/jcf-depend.o java/jcf-path.o java/boehm.o java/java-gimplify.o main.o tree-browser.o libbackend.a libcommon-target.a libcommon.a ../libcpp/libcpp.a ../libdecnumber/libdecnumber.a -lz  libcommon.a ../libcpp/libcpp.a   ../libiberty/libiberty.a ../libdecnumber/libdecnumber.a  attribs.o -lcloog -lppl_c -lppl  -lgmpxx -lmpc -lmpfr -lgmp -rdynamic -ldl  -lz
/export/gnu/import/svn/gcc-test-profile/bld/./prev-gcc/g++ -B/export/gnu/import/svn/gcc-test-profile/bld/./prev-gcc/ -B/usr/local/x86_64-unknown-linux-gnu/bin/ -nostdinc++ -B/export/gnu/import/svn/gcc-test-profile/bld/prev-x86_64-unknown-linux-gnu/libstdc++-v3/src/.libs -B/export/gnu/import/svn/gcc-test-profile/bld/prev-x86_64-unknown-linux-gnu/libstdc++-v3/libsupc++/.libs -I/export/gnu/import/svn/gcc-test-profile/bld/prev-x86_64-unknown-linux-gnu/libstdc++-v3/include/x86_64-unknown-linux-gnu -I/export/gnu/import/svn/gcc-test-profile/bld/prev-x86_64-unknown-linux-gnu/libstdc++-v3/include -I/export/gnu/import/svn/gcc-test-profile/src-trunk/libstdc++-v3/libsupc++ -L/export/gnu/import/svn/gcc-test-profile/bld/prev-x86_64-unknown-linux-gnu/libstdc++-v3/src/.libs -L/export/gnu/import/svn/gcc-test-profile/bld/prev-x86_64-unknown-linux-gnu/libstdc++-v3/libsupc++/.libs -c  -DIN_GCC_FRONTEND -g -O2 -flto=jobserver -frandom-seed=1 -fprofile-use -DIN_GCC   -fno-exceptions -fno-rtti -W -Wall -Wno-narrowing -Wwrite-strings -Wcast-qual -Wmissing-format-attribute -pedantic -Wno-long-long -Wno-variadic-macros -Wno-overlength-strings -Werror -fno-common  -DHAVE_CONFIG_H -I. -I. -I../../src-trunk/gcc -I../../src-trunk/gcc/. -I../../src-trunk/gcc/../include -I../../src-trunk/gcc/../libcpp/include  -I../../src-trunk/gcc/../libdecnumber -I../../src-trunk/gcc/../libdecnumber/bid -I../libdecnumber    cc1obj-checksum.c -o cc1obj-checksum.o
/export/gnu/import/svn/gcc-test-profile/bld/./prev-gcc/g++ -B/export/gnu/import/svn/gcc-test-profile/bld/./prev-gcc/ -B/usr/local/x86_64-unknown-linux-gnu/bin/ -nostdinc++ -B/export/gnu/import/svn/gcc-test-profile/bld/prev-x86_64-unknown-linux-gnu/libstdc++-v3/src/.libs -B/export/gnu/import/svn/gcc-test-profile/bld/prev-x86_64-unknown-linux-gnu/libstdc++-v3/libsupc++/.libs -I/export/gnu/import/svn/gcc-test-profile/bld/prev-x86_64-unknown-linux-gnu/libstdc++-v3/include/x86_64-unknown-linux-gnu -I/export/gnu/import/svn/gcc-test-profile/bld/prev-x86_64-unknown-linux-gnu/libstdc++-v3/include -I/export/gnu/import/svn/gcc-test-profile/src-trunk/libstdc++-v3/libsupc++ -L/export/gnu/import/svn/gcc-test-profile/bld/prev-x86_64-unknown-linux-gnu/libstdc++-v3/src/.libs -L/export/gnu/import/svn/gcc-test-profile/bld/prev-x86_64-unknown-linux-gnu/libstdc++-v3/libsupc++/.libs -c   -g -O2 -flto=jobserver -frandom-seed=1 -fprofile-use -DIN_GCC   -fno-exceptions -fno-rtti -W -Wall -Wno-narrowing -Wwrite-strings -Wcast-qual -Wmissing-format-attribute -pedantic -Wno-long-long -Wno-variadic-macros -Wno-overlength-strings -Werror -fno-common  -DHAVE_CONFIG_H -I. -I. -I../../src-trunk/gcc -I../../src-trunk/gcc/. -I../../src-trunk/gcc/../include -I../../src-trunk/gcc/../libcpp/include  -I../../src-trunk/gcc/../libdecnumber -I../../src-trunk/gcc/../libdecnumber/bid -I../libdecnumber    cc1-checksum.c -o cc1-checksum.o
/export/gnu/import/svn/gcc-test-profile/bld/./prev-gcc/g++ -B/export/gnu/import/svn/gcc-test-profile/bld/./prev-gcc/ -B/usr/local/x86_64-unknown-linux-gnu/bin/ -nostdinc++ -B/export/gnu/import/svn/gcc-test-profile/bld/prev-x86_64-unknown-linux-gnu/libstdc++-v3/src/.libs -B/export/gnu/import/svn/gcc-test-profile/bld/prev-x86_64-unknown-linux-gnu/libstdc++-v3/libsupc++/.libs -I/export/gnu/import/svn/gcc-test-profile/bld/prev-x86_64-unknown-linux-gnu/libstdc++-v3/include/x86_64-unknown-linux-gnu -I/export/gnu/import/svn/gcc-test-profile/bld/prev-x86_64-unknown-linux-gnu/libstdc++-v3/include -I/export/gnu/import/svn/gcc-test-profile/src-trunk/libstdc++-v3/libsupc++ -L/export/gnu/import/svn/gcc-test-profile/bld/prev-x86_64-unknown-linux-gnu/libstdc++-v3/src/.libs -L/export/gnu/import/svn/gcc-test-profile/bld/prev-x86_64-unknown-linux-gnu/libstdc++-v3/libsupc++/.libs -c  -DIN_GCC_FRONTEND -g -O2 -flto=jobserver -frandom-seed=1 -fprofile-use -DIN_GCC   -fno-exceptions -fno-rtti -W -Wall -Wno-narrowing -Wwrite-strings -Wcast-qual -Wmissing-format-attribute -pedantic -Wno-long-long -Wno-variadic-macros -Wno-overlength-strings -Werror -fno-common  -DHAVE_CONFIG_H -I. -I. -I../../src-trunk/gcc -I../../src-trunk/gcc/. -I../../src-trunk/gcc/../include -I../../src-trunk/gcc/../libcpp/include  -I../../src-trunk/gcc/../libdecnumber -I../../src-trunk/gcc/../libdecnumber/bid -I../libdecnumber    cc1plus-checksum.c -o cc1plus-checksum.o
/export/gnu/import/svn/gcc-test-profile/bld/./prev-gcc/g++ -B/export/gnu/import/svn/gcc-test-profile/bld/./prev-gcc/ -B/usr/local/x86_64-unknown-linux-gnu/bin/ -nostdinc++ -B/export/gnu/import/svn/gcc-test-profile/bld/prev-x86_64-unknown-linux-gnu/libstdc++-v3/src/.libs -B/export/gnu/import/svn/gcc-test-profile/bld/prev-x86_64-unknown-linux-gnu/libstdc++-v3/libsupc++/.libs -I/export/gnu/import/svn/gcc-test-profile/bld/prev-x86_64-unknown-linux-gnu/libstdc++-v3/include/x86_64-unknown-linux-gnu -I/export/gnu/import/svn/gcc-test-profile/bld/prev-x86_64-unknown-linux-gnu/libstdc++-v3/include -I/export/gnu/import/svn/gcc-test-profile/src-trunk/libstdc++-v3/libsupc++ -L/export/gnu/import/svn/gcc-test-profile/bld/prev-x86_64-unknown-linux-gnu/libstdc++-v3/src/.libs -L/export/gnu/import/svn/gcc-test-profile/bld/prev-x86_64-unknown-linux-gnu/libstdc++-v3/libsupc++/.libs   -g -O2 -flto=jobserver -frandom-seed=1 -fprofile-use -DIN_GCC   -fno-exceptions -fno-rtti -W -Wall -Wno-narrowing -Wwrite-strings -Wcast-qual -Wmissing-format-attribute -pedantic -Wno-long-long -Wno-variadic-macros -Wno-overlength-strings -Werror -fno-common  -DHAVE_CONFIG_H -static-libstdc++ -static-libgcc  -o cc1obj \
      objc/objc-lang.o objc/objc-act.o objc/objc-runtime-shared-support.o objc/objc-gnu-runtime-abi-01.o objc/objc-next-runtime-abi-01.o objc/objc-next-runtime-abi-02.o objc/objc-encoding.o objc/objc-map.o attribs.o c-errors.o c-decl.o c-typeck.o c-convert.o c-aux-info.o c-objc-common.o c-parser.o tree-mudflap.o c-family/c-common.o c-family/c-cppbuiltin.o c-family/c-dump.o c-family/c-format.o c-family/c-gimplify.o c-family/c-lex.o c-family/c-omp.o c-family/c-opts.o c-family/c-pch.o c-family/c-ppoutput.o c-family/c-pragma.o c-family/c-pretty-print.o c-family/c-semantics.o c-family/c-ada-spec.o i386-c.o default-c.o cc1obj-checksum.o \
      main.o tree-browser.o libbackend.a libcommon-target.a libcommon.a ../libcpp/libcpp.a ../libdecnumber/libdecnumber.a libcommon.a ../libcpp/libcpp.a   ../libiberty/libiberty.a ../libdecnumber/libdecnumber.a  -lcloog -lppl_c -lppl  -lgmpxx -lmpc -lmpfr -lgmp -rdynamic -ldl  -lz
/export/gnu/import/svn/gcc-test-profile/bld/./prev-gcc/g++ -B/export/gnu/import/svn/gcc-test-profile/bld/./prev-gcc/ -B/usr/local/x86_64-unknown-linux-gnu/bin/ -nostdinc++ -B/export/gnu/import/svn/gcc-test-profile/bld/prev-x86_64-unknown-linux-gnu/libstdc++-v3/src/.libs -B/export/gnu/import/svn/gcc-test-profile/bld/prev-x86_64-unknown-linux-gnu/libstdc++-v3/libsupc++/.libs -I/export/gnu/import/svn/gcc-test-profile/bld/prev-x86_64-unknown-linux-gnu/libstdc++-v3/include/x86_64-unknown-linux-gnu -I/export/gnu/import/svn/gcc-test-profile/bld/prev-x86_64-unknown-linux-gnu/libstdc++-v3/include -I/export/gnu/import/svn/gcc-test-profile/src-trunk/libstdc++-v3/libsupc++ -L/export/gnu/import/svn/gcc-test-profile/bld/prev-x86_64-unknown-linux-gnu/libstdc++-v3/src/.libs -L/export/gnu/import/svn/gcc-test-profile/bld/prev-x86_64-unknown-linux-gnu/libstdc++-v3/libsupc++/.libs   -g -O2 -flto=jobserver -frandom-seed=1 -fprofile-use -DIN_GCC   -fno-exceptions -fno-rtti -W -Wall -Wno-narrowing -Wwrite-strings -Wcast-qual -Wmissing-format-attribute -pedantic -Wno-long-long -Wno-variadic-macros -Wno-overlength-strings -Werror -fno-common  -DHAVE_CONFIG_H -static-libstdc++ -static-libgcc  -o cc1 c-lang.o c-family/stub-objc.o attribs.o c-errors.o c-decl.o c-typeck.o c-convert.o c-aux-info.o c-objc-common.o c-parser.o tree-mudflap.o c-family/c-common.o c-family/c-cppbuiltin.o c-family/c-dump.o c-family/c-format.o c-family/c-gimplify.o c-family/c-lex.o c-family/c-omp.o c-family/c-opts.o c-family/c-pch.o c-family/c-ppoutput.o c-family/c-pragma.o c-family/c-pretty-print.o c-family/c-semantics.o c-family/c-ada-spec.o i386-c.o default-c.o \
  cc1-checksum.o main.o tree-browser.o libbackend.a libcommon-target.a libcommon.a ../libcpp/libcpp.a ../libdecnumber/libdecnumber.a libcommon.a ../libcpp/libcpp.a   ../libiberty/libiberty.a ../libdecnumber/libdecnumber.a  -lcloog -lppl_c -lppl  -lgmpxx -lmpc -lmpfr -lgmp -rdynamic -ldl  -lz
/export/gnu/import/svn/gcc-test-profile/bld/./prev-gcc/g++ -B/export/gnu/import/svn/gcc-test-profile/bld/./prev-gcc/ -B/usr/local/x86_64-unknown-linux-gnu/bin/ -nostdinc++ -B/export/gnu/import/svn/gcc-test-profile/bld/prev-x86_64-unknown-linux-gnu/libstdc++-v3/src/.libs -B/export/gnu/import/svn/gcc-test-profile/bld/prev-x86_64-unknown-linux-gnu/libstdc++-v3/libsupc++/.libs -I/export/gnu/import/svn/gcc-test-profile/bld/prev-x86_64-unknown-linux-gnu/libstdc++-v3/include/x86_64-unknown-linux-gnu -I/export/gnu/import/svn/gcc-test-profile/bld/prev-x86_64-unknown-linux-gnu/libstdc++-v3/include -I/export/gnu/import/svn/gcc-test-profile/src-trunk/libstdc++-v3/libsupc++ -L/export/gnu/import/svn/gcc-test-profile/bld/prev-x86_64-unknown-linux-gnu/libstdc++-v3/src/.libs -L/export/gnu/import/svn/gcc-test-profile/bld/prev-x86_64-unknown-linux-gnu/libstdc++-v3/libsupc++/.libs   -g -O2 -flto=jobserver -frandom-seed=1 -fprofile-use -DIN_GCC   -fno-exceptions -fno-rtti -W -Wall -Wno-narrowing -Wwrite-strings -Wcast-qual -Wmissing-format-attribute -pedantic -Wno-long-long -Wno-variadic-macros -Wno-overlength-strings -Werror -fno-common  -DHAVE_CONFIG_H -static-libstdc++ -static-libgcc  -o cc1plus \
      cp/cp-lang.o c-family/stub-objc.o cp/call.o cp/decl.o cp/expr.o cp/pt.o cp/typeck2.o cp/class.o cp/decl2.o cp/error.o cp/lex.o cp/parser.o cp/ptree.o cp/rtti.o cp/typeck.o cp/cvt.o cp/except.o cp/friend.o cp/init.o cp/method.o cp/search.o cp/semantics.o cp/tree.o cp/repo.o cp/dump.o cp/optimize.o cp/mangle.o cp/cp-objcp-common.o cp/name-lookup.o cp/cxx-pretty-print.o cp/cp-gimplify.o tree-mudflap.o attribs.o incpath.o c-family/c-common.o c-family/c-cppbuiltin.o c-family/c-dump.o c-family/c-format.o c-family/c-gimplify.o c-family/c-lex.o c-family/c-omp.o c-family/c-opts.o c-family/c-pch.o c-family/c-ppoutput.o c-family/c-pragma.o c-family/c-pretty-print.o c-family/c-semantics.o c-family/c-ada-spec.o i386-c.o default-c.o cc1plus-checksum.o main.o tree-browser.o libbackend.a libcommon-target.a libcommon.a ../libcpp/libcpp.a ../libdecnumber/libdecnumber.a libcommon.a ../libcpp/libcpp.a   ../libiberty/libiberty.a ../libdecnumber/libdecnumber.a  -lcloog -lppl_c -lppl  -lgmpxx -lmpc -lmpfr -lgmp -rdynamic -ldl  -lz
In function 'objc_finish_foreach_loop':
lto1: internal compiler error: in cgraph_add_edge_to_call_site_hash, at cgraph.c:765
Please submit a full bug report,
with preprocessed source if appropriate.
See <http://gcc.gnu.org/bugs.html> for instructions.
make[7]: *** [/tmp/ccqlIR1N.ltrans1.ltrans.o] Error 1
lto-wrapper: make returned 2 exit status
/usr/local/x86_64-unknown-linux-gnu/bin/ld: lto-wrapper failed
collect2: error: ld returned 1 exit status
make[6]: *** [cc1obj] Error 1
make[6]: *** Waiting for unfinished jobs....
In function 'c_parser_declaration_or_fndef':
lto1: internal compiler error: in cgraph_add_edge_to_call_site_hash, at cgraph.c:765
Please submit a full bug report,
with preprocessed source if appropriate.
See <http://gcc.gnu.org/bugs.html> for instructions.
make[7]: *** [/tmp/ccxjaV9M.ltrans29.ltrans.o] Error 1
lto-wrapper: make returned 2 exit status
/usr/local/x86_64-unknown-linux-gnu/bin/ld: lto-wrapper failed
collect2: error: ld returned 1 exit status
make[6]: *** [cc1] Error 1
In function 'gfc_conv_expr_descriptor':
lto1: internal compiler error: in cgraph_add_edge_to_call_site_hash, at cgraph.c:765
Please submit a full bug report,
with preprocessed source if appropriate.
See <http://gcc.gnu.org/bugs.html> for instructions.
make[7]: *** [/tmp/ccAtlMNv.ltrans29.ltrans.o] Error 1
make[7]: *** Waiting for unfinished jobs....
lto-wrapper: make returned 2 exit status
/usr/local/x86_64-unknown-linux-gnu/bin/ld: lto-wrapper failed
collect2: error: ld returned 1 exit status
make[6]: *** [f951] Error 1
rm gcj-dbtool.pod jcf-dump.pod jv-convert.pod grmic.pod gcj.pod gc-analyze.pod gfdl.pod cpp.pod gij.pod gcov.pod gfortran.pod gcc.pod fsf-funding.pod
make[6]: Leaving directory `/export/gnu/import/svn/gcc-test-profile/bld/gcc'
make[5]: *** [all-stagefeedback-gcc] Error 2
make[5]: Leaving directory `/export/gnu/import/svn/gcc-test-profile/bld'
make[4]: *** [stagefeedback-bubble] Error 2
make[4]: Leaving directory `/export/gnu/import/svn/gcc-test-profile/bld'
make[3]: *** [profiledbootstrap] Error 2
make[3]: Leaving directory `/export/gnu/import/svn/gcc-test-profile/bld'
20727.08user 780.29system 1:11:52elapsed 498%CPU (0avgtext+0avgdata 538908maxresident)k
270208inputs+28170544outputs (7274major+147100666minor)pagefaults 0swaps
make[2]: *** [profiledbootstrap] Error 2
make[2]: Leaving directory `/export/gnu/import/svn/gcc-test-profile'



More information about the Gcc-regression mailing list