NEW GCC build failure, HEAD@181009 on native

GCC regression tester regress@geoffk.org
Sat Nov 5 11:14:00 GMT 2011


With your recent patch, GCC HEAD revision 181009 had problems on:
native: build (NEW build failure)
Attached is build output for those targets.
The previous build was of revision 181007.

Log information for changes since the last build:
------------------------------------------------------------------------
r181009 | ebotcazou | 2011-11-05 03:44:45 -0700 (Sat, 05 Nov 2011) | 3 lines
Changed paths:
   M /trunk/gcc/testsuite/ChangeLog
   M /trunk/gcc/testsuite/gcc.dg/strlenopt-22.c
   A /trunk/gcc/testsuite/gcc.dg/strlenopt-22g.c

	* gcc.dg/strlenopt-22g.c: New wrapper around...
	* gcc.dg/strlenopt-22.c: ...this.  Do not define USE_GNU and adjust.

------------------------------------------------------------------------

For more information, see <http://glutton.geoffk.org/HEAD/>.

-------------- next part --------------
/home/regress/tbox/native/build/./gcc/xgcc -B/home/regress/tbox/native/build/./gcc/ -B/home/regress/tbox/objs/i686-pc-linux-gnu/bin/ -B/home/regress/tbox/objs/i686-pc-linux-gnu/lib/ -isystem /home/regress/tbox/objs/i686-pc-linux-gnu/include -isystem /home/regress/tbox/objs/i686-pc-linux-gnu/sys-include    -g -O2 -O2 -g -O2 -DIN_GCC   -W -Wall -Wno-narrowing -Wwrite-strings -Wcast-qual -Wstrict-prototypes -Wmissing-prototypes -Wold-style-definition  -isystem ./include  -I. -I. -I../.././gcc -I/home/regress/tbox/svn-gcc/libgcc -I/home/regress/tbox/svn-gcc/libgcc/. -I/home/regress/tbox/svn-gcc/libgcc/../gcc -I/home/regress/tbox/svn-gcc/libgcc/../include -I/home/regress/tbox/svn-gcc/libgcc/config/libbid -DENABLE_DECIMAL_BID_FORMAT  -g0 -finhibit-size-directive -fno-inline -fno-exceptions -fno-zero-initialized-in-bss -fno-toplevel-reorder -fno-tree-vectorize -fno-stack-protector  -I. -I. -I../.././gcc -I/home/regress/tbox/svn-gcc/libgcc -I/home/regress/tbox/svn-gcc/libgcc/. -I/ho!
 me/regress/tbox/svn-gcc/libgcc/../gcc -I/home/regress/tbox/svn-gcc/libgcc/../include -I/home/regress/tbox/svn-gcc/libgcc/config/libbid -DENABLE_DECIMAL_BID_FORMAT -o crtbeginT.o -MT crtbeginT.o -MD -MP -MF crtbeginT.dep  -fno-omit-frame-pointer -fno-asynchronous-unwind-tables -c /home/regress/tbox/svn-gcc/libgcc/crtstuff.c -DCRT_BEGIN -DCRTSTUFFT_O
/home/regress/tbox/svn-gcc/libgcc/crtstuff.c:65:23: fatal error: libgcc_tm.h: No such file or directory
compilation terminated.
/home/regress/tbox/svn-gcc/libgcc/crtstuff.c:65:23: fatal error: libgcc_tm.h: No such file or directory
compilation terminated.
make[3]: *** [crtbegin.o] Error 1
make[3]: *** Waiting for unfinished jobs....
make[3]: *** [crtbeginS.o] Error 1
/bin/sh /home/regress/tbox/svn-gcc/libgcc/../move-if-change tmp-libgcc_tm.h libgcc_tm.h
echo timestamp > libgcc_tm.stamp
/home/regress/tbox/svn-gcc/libgcc/crtstuff.c: In function 'frame_dummy':
/home/regress/tbox/svn-gcc/libgcc/crtstuff.c:387:19: warning: array subscript is above array bounds [-Warray-bounds]
make[3]: Leaving directory `/home/regress/tbox/native/build/i686-pc-linux-gnu/libgcc'
make[2]: *** [all-stage2-target-libgcc] Error 2
make[2]: Leaving directory `/home/regress/tbox/native/build'
make[1]: *** [stage2-bubble] Error 2
make[1]: Leaving directory `/home/regress/tbox/native/build'
make: *** [bootstrap] Error 2
+ '[' -s .bad_compare ']'
+ exit 1
-------------- next part --------------

-- 
Geoffrey Keating <geoffk@geoffk.org> 
(via an automated GCC regression-testing script.)


More information about the Gcc-regression mailing list