NEW GCC build failure, HEAD@180821 on native

GCC regression tester regress@geoffk.org
Thu Nov 3 12:43:00 GMT 2011


With your recent patch, GCC HEAD revision 180821 had problems on:
native: build (NEW build failure)
Attached is build output for those targets.
The previous build was of revision 180820.

Log information for changes since the last build:
------------------------------------------------------------------------
r180821 | gingold | 2011-11-03 04:47:12 -0700 (Thu, 03 Nov 2011) | 5 lines
Changed paths:
   M /trunk/gcc/ChangeLog
   M /trunk/gcc/collect2.c

2011-11-03  Tristan Gingold  <gingold@adacore.com>

	* collect2.c (main): Add support of -f (response file) on AIX.


------------------------------------------------------------------------

For more information, see <http://glutton.geoffk.org/HEAD/>.

-------------- next part --------------
/home/regress/tbox/native/build/./prev-gcc/g++ -B/home/regress/tbox/native/build/./prev-gcc/ -B/home/regress/tbox/objs/i686-pc-linux-gnu/bin/ -nostdinc++ -B/home/regress/tbox/native/build/prev-i686-pc-linux-gnu/libstdc++-v3/src/.libs -B/home/regress/tbox/native/build/prev-i686-pc-linux-gnu/libstdc++-v3/libsupc++/.libs -I/home/regress/tbox/native/build/prev-i686-pc-linux-gnu/libstdc++-v3/include/i686-pc-linux-gnu -I/home/regress/tbox/native/build/prev-i686-pc-linux-gnu/libstdc++-v3/include -I/home/regress/tbox/svn-gcc/libstdc++-v3/libsupc++ -L/home/regress/tbox/native/build/prev-i686-pc-linux-gnu/libstdc++-v3/src/.libs -L/home/regress/tbox/native/build/prev-i686-pc-linux-gnu/libstdc++-v3/libsupc++/.libs -c  -DIN_GCC_FRONTEND -g -O2 -gtoggle -DIN_GCC   -W -Wall -Wno-narrowing -Wwrite-strings -Wcast-qual -Wmissing-format-attribute -pedantic -Wno-long-long -Wno-variadic-macros -Wno-overlength-strings -Werror -fno-common  -DHAVE_CONFIG_H -I. -Iobjc -I/home/regress/tbox/svn-gcc/gc!
 c -I/home/regress/tbox/svn-gcc/gcc/objc -I/home/regress/tbox/svn-gcc/gcc/../include -I/home/regress/tbox/svn-gcc/gcc/../libcpp/include  -I/home/regress/tbox/svn-gcc/gcc/../libdecnumber -I/home/regress/tbox/svn-gcc/gcc/../libdecnumber/bid -I../libdecnumber    /home/regress/tbox/svn-gcc/gcc/objc/objc-next-runtime-abi-01.c -o objc/objc-next-runtime-abi-01.o
/home/regress/tbox/native/build/./prev-gcc/g++ -B/home/regress/tbox/native/build/./prev-gcc/ -B/home/regress/tbox/objs/i686-pc-linux-gnu/bin/ -nostdinc++ -B/home/regress/tbox/native/build/prev-i686-pc-linux-gnu/libstdc++-v3/src/.libs -B/home/regress/tbox/native/build/prev-i686-pc-linux-gnu/libstdc++-v3/libsupc++/.libs -I/home/regress/tbox/native/build/prev-i686-pc-linux-gnu/libstdc++-v3/include/i686-pc-linux-gnu -I/home/regress/tbox/native/build/prev-i686-pc-linux-gnu/libstdc++-v3/include -I/home/regress/tbox/svn-gcc/libstdc++-v3/libsupc++ -L/home/regress/tbox/native/build/prev-i686-pc-linux-gnu/libstdc++-v3/src/.libs -L/home/regress/tbox/native/build/prev-i686-pc-linux-gnu/libstdc++-v3/libsupc++/.libs -c  -DIN_GCC_FRONTEND -g -O2 -gtoggle -DIN_GCC   -W -Wall -Wno-narrowing -Wwrite-strings -Wcast-qual -Wmissing-format-attribute -pedantic -Wno-long-long -Wno-variadic-macros -Wno-overlength-strings -Werror -fno-common  -DHAVE_CONFIG_H -I. -Iobjc -I/home/regress/tbox/svn-gcc/gc!
 c -I/home/regress/tbox/svn-gcc/gcc/objc -I/home/regress/tbox/svn-gcc/gcc/../include -I/home/regress/tbox/svn-gcc/gcc/../libcpp/include  -I/home/regress/tbox/svn-gcc/gcc/../libdecnumber -I/home/regress/tbox/svn-gcc/gcc/../libdecnumber/bid -I../libdecnumber    /home/regress/tbox/svn-gcc/gcc/objc/objc-next-runtime-abi-02.c -o objc/objc-next-runtime-abi-02.o
/home/regress/tbox/native/build/./prev-gcc/g++ -B/home/regress/tbox/native/build/./prev-gcc/ -B/home/regress/tbox/objs/i686-pc-linux-gnu/bin/ -nostdinc++ -B/home/regress/tbox/native/build/prev-i686-pc-linux-gnu/libstdc++-v3/src/.libs -B/home/regress/tbox/native/build/prev-i686-pc-linux-gnu/libstdc++-v3/libsupc++/.libs -I/home/regress/tbox/native/build/prev-i686-pc-linux-gnu/libstdc++-v3/include/i686-pc-linux-gnu -I/home/regress/tbox/native/build/prev-i686-pc-linux-gnu/libstdc++-v3/include -I/home/regress/tbox/svn-gcc/libstdc++-v3/libsupc++ -L/home/regress/tbox/native/build/prev-i686-pc-linux-gnu/libstdc++-v3/src/.libs -L/home/regress/tbox/native/build/prev-i686-pc-linux-gnu/libstdc++-v3/libsupc++/.libs -c  -DIN_GCC_FRONTEND -g -O2 -gtoggle -DIN_GCC   -W -Wall -Wno-narrowing -Wwrite-strings -Wcast-qual -Wmissing-format-attribute -pedantic -Wno-long-long -Wno-variadic-macros -Wno-overlength-strings -Werror -fno-common  -DHAVE_CONFIG_H -I. -Iobjc -I/home/regress/tbox/svn-gcc/gc!
 c -I/home/regress/tbox/svn-gcc/gcc/objc -I/home/regress/tbox/svn-gcc/gcc/../include -I/home/regress/tbox/svn-gcc/gcc/../libcpp/include  -I/home/regress/tbox/svn-gcc/gcc/../libdecnumber -I/home/regress/tbox/svn-gcc/gcc/../libdecnumber/bid -I../libdecnumber    /home/regress/tbox/svn-gcc/gcc/objc/objc-encoding.c -o objc/objc-encoding.o
/home/regress/tbox/native/build/./prev-gcc/g++ -B/home/regress/tbox/native/build/./prev-gcc/ -B/home/regress/tbox/objs/i686-pc-linux-gnu/bin/ -nostdinc++ -B/home/regress/tbox/native/build/prev-i686-pc-linux-gnu/libstdc++-v3/src/.libs -B/home/regress/tbox/native/build/prev-i686-pc-linux-gnu/libstdc++-v3/libsupc++/.libs -I/home/regress/tbox/native/build/prev-i686-pc-linux-gnu/libstdc++-v3/include/i686-pc-linux-gnu -I/home/regress/tbox/native/build/prev-i686-pc-linux-gnu/libstdc++-v3/include -I/home/regress/tbox/svn-gcc/libstdc++-v3/libsupc++ -L/home/regress/tbox/native/build/prev-i686-pc-linux-gnu/libstdc++-v3/src/.libs -L/home/regress/tbox/native/build/prev-i686-pc-linux-gnu/libstdc++-v3/libsupc++/.libs -c  -DIN_GCC_FRONTEND -g -O2 -gtoggle -DIN_GCC   -W -Wall -Wno-narrowing -Wwrite-strings -Wcast-qual -Wmissing-format-attribute -pedantic -Wno-long-long -Wno-variadic-macros -Wno-overlength-strings -Werror -fno-common  -DHAVE_CONFIG_H -I. -Iobjc -I/home/regress/tbox/svn-gcc/gc!
 c -I/home/regress/tbox/svn-gcc/gcc/objc -I/home/regress/tbox/svn-gcc/gcc/../include -I/home/regress/tbox/svn-gcc/gcc/../libcpp/include  -I/home/regress/tbox/svn-gcc/gcc/../libdecnumber -I/home/regress/tbox/svn-gcc/gcc/../libdecnumber/bid -I../libdecnumber    /home/regress/tbox/svn-gcc/gcc/objc/objc-map.c -o objc/objc-map.o
/home/regress/tbox/native/build/./prev-gcc/g++ -B/home/regress/tbox/native/build/./prev-gcc/ -B/home/regress/tbox/objs/i686-pc-linux-gnu/bin/ -nostdinc++ -B/home/regress/tbox/native/build/prev-i686-pc-linux-gnu/libstdc++-v3/src/.libs -B/home/regress/tbox/native/build/prev-i686-pc-linux-gnu/libstdc++-v3/libsupc++/.libs -I/home/regress/tbox/native/build/prev-i686-pc-linux-gnu/libstdc++-v3/include/i686-pc-linux-gnu -I/home/regress/tbox/native/build/prev-i686-pc-linux-gnu/libstdc++-v3/include -I/home/regress/tbox/svn-gcc/libstdc++-v3/libsupc++ -L/home/regress/tbox/native/build/prev-i686-pc-linux-gnu/libstdc++-v3/src/.libs -L/home/regress/tbox/native/build/prev-i686-pc-linux-gnu/libstdc++-v3/libsupc++/.libs -c  -DTARGET_MACHINE=\"i686-pc-linux-gnu\"  -g -O2 -gtoggle -DIN_GCC   -W -Wall -Wno-narrowing -Wwrite-strings -Wcast-qual -Wmissing-format-attribute -pedantic -Wno-long-long -Wno-variadic-macros -Wno-overlength-strings -Werror -fno-common  -DHAVE_CONFIG_H -I. -I. -I/home/regr!
 ess/tbox/svn-gcc/gcc -I/home/regress/tbox/svn-gcc/gcc/. -I/home/regress/tbox/svn-gcc/gcc/../include -I/home/regress/tbox/svn-gcc/gcc/../libcpp/include  -I/home/regress/tbox/svn-gcc/gcc/../libdecnumber -I/home/regress/tbox/svn-gcc/gcc/../libdecnumber/bid -I../libdecnumber    /home/regress/tbox/svn-gcc/gcc/collect2.c -o collect2.o
/home/regress/tbox/svn-gcc/gcc/collect2.c: In function 'int main(int, char**)':
/home/regress/tbox/svn-gcc/gcc/collect2.c:1094:7: error: unused variable 'object_nbr' [-Werror=unused-variable]
cc1plus: all warnings being treated as errors

make[3]: *** [collect2.o] Error 1
make[3]: *** Waiting for unfinished jobs....
rm gcj-dbtool.pod jcf-dump.pod jv-convert.pod grmic.pod gcov.pod gcj.pod gc-analyze.pod gfdl.pod cpp.pod gij.pod gfortran.pod fsf-funding.pod gcc.pod
make[3]: Leaving directory `/home/regress/tbox/native/build/gcc'
make[2]: *** [all-stage2-gcc] Error 2
make[2]: Leaving directory `/home/regress/tbox/native/build'
make[1]: *** [stage2-bubble] Error 2
make[1]: Leaving directory `/home/regress/tbox/native/build'
make: *** [bootstrap] Error 2
+ '[' -s .bad_compare ']'
+ exit 1
-------------- next part --------------

-- 
Geoffrey Keating <geoffk@geoffk.org> 
(via an automated GCC regression-testing script.)


More information about the Gcc-regression mailing list