GCC build failure, HEAD@176249 on native
GCC regression tester
regress@geoffk.org
Wed Jul 13 19:23:00 GMT 2011
With your recent patch, GCC HEAD revision 176249 had problems on:
native: build (about the same as the previous build)
Attached is build output for those targets.
The previous build was of revision 176247.
Log information for changes since the last build:
------------------------------------------------------------------------
r176248 | tschwinge | 2011-07-13 12:17:21 -0700 (Wed, 13 Jul 2011) | 3 lines
Changed paths:
M /trunk/gcc/ChangeLog
M /trunk/gcc/acinclude.m4
M /trunk/gcc/configure
gcc/
* acinclude.m4 (gcc_GAS_CHECK_FEATURE): Use AS_ECHO instead of echo.
* configure: Regenerate.
------------------------------------------------------------------------
r176249 | uweigand | 2011-07-13 12:19:35 -0700 (Wed, 13 Jul 2011) | 3 lines
Changed paths:
M /trunk/gcc/ChangeLog
M /trunk/gcc/config/spu/spu.c
M /trunk/gcc/config/spu/spu.md
* config/spu/spu.c (spu_init_libfuncs): Install __clrsbdi2.
* config/spu/spu.md ("clrsb<mode>2"): New expander.
------------------------------------------------------------------------
For more information, see <http://glutton.geoffk.org/HEAD/>.
-------------- next part --------------
# If the gcc directory specifies which extra parts to
# build for this target, and the libgcc configuration also
ranlib libgcc_eh.a
# specifies, make sure they match. This can be removed
# when the gcc directory no longer holds libgcc configuration;
# it is useful when migrating a target.
Configuration mismatch!
Extra parts from gcc directory: crtbegin.o crtbeginS.o crtbeginT.o crtend.o crtendS.o
Extra parts from libgcc: crtbegin.o crtbeginS.o crtbeginT.o crtend.o crtendS.o crtprec32.o crtprec64.o crtprec80.o crtfastmath.o
exit 1
make[3]: *** [libgcc-extra-parts] Error 1
make[3]: *** Waiting for unfinished jobs....
make[3]: Leaving directory `/home/regress/tbox/native/build/i686-pc-linux-gnu/libgcc'
make[2]: *** [all-stage1-target-libgcc] Error 2
make[2]: Leaving directory `/home/regress/tbox/native/build'
make[1]: *** [stage1-bubble] Error 2
make[1]: Leaving directory `/home/regress/tbox/native/build'
make: *** [bootstrap] Error 2
+ '[' -s .bad_compare ']'
+ exit 1
-------------- next part --------------
--
Geoffrey Keating <geoffk@geoffk.org>
(via an automated GCC regression-testing script.)
More information about the Gcc-regression
mailing list