Gcc [trunk revision 170417] failed to bootstrap on x86_64!

Johann Steinbrecher jsteinbr@gnu-35.sc.intel.com
Wed Feb 23 00:58:00 GMT 2011


rm -rf bld
mkdir -p bld
cd bld; \
	 RUNTESTFLAGS="--target_board='unix{-m32,}'" ../src-trunk/configure \
		 --prefix=/export/server/build-server/gcc-test/usr --enable-clocale=gnu --with-system-zlib --enable-shared --with-demangler-in-ld --enable-cloog-backend=isl --with-ppl-include=/opt/gnu/include --with-ppl-lib=/opt/gnu/lib64 --with-cloog-include=/opt/gnu/include --with-cloog-lib=/opt/gnu/lib64 --with-fpmath=sse --enable-languages=c,c++,fortran
checking build system type... x86_64-unknown-linux-gnu
checking host system type... x86_64-unknown-linux-gnu
	    grep "Error " makelog.170417.trunk.x86_64 >> makelog.170417.trunk.x86_64.mail; \
make[6]: *** [sha1.o] Error 1
make[6]: *** [md5.o] Error 1
make[6]: *** [regex.o] Error 1
make[6]: *** [md5.o] Error 1
make[6]: *** [regex.o] Error 1
make[5]: *** [all-stage1-libiberty] Error 2
make[5]: *** [all-build-libiberty] Error 2
make[4]: *** [stage1-bubble] Error 2
make[3]: *** [bootstrap] Error 2
make[2]: *** [bootstrap] Error 2
checking limits.h usability... no
checking limits.h presence... yes
configure: WARNING: limits.h: present but cannot be compiled
configure: WARNING: limits.h:     check for missing prerequisite headers?
configure: WARNING: limits.h: see the Autoconf documentation
configure: WARNING: limits.h:     section "Present But Cannot Be Compiled"
configure: WARNING: limits.h: proceeding with the compiler's result
configure: WARNING:     ## ----------------------------------- ##
configure: WARNING:     ## Report this to gcc-bugs@gcc.gnu.org ##
configure: WARNING:     ## ----------------------------------- ##
checking for limits.h... no
checking stddef.h usability... yes
checking stddef.h presence... yes
checking for stddef.h... yes
checking for stdlib.h... (cached) yes
checking for strings.h... (cached) yes
checking for string.h... (cached) yes
checking sys/file.h usability... yes
checking sys/file.h presence... yes
checking for sys/file.h... yes
checking for unistd.h... (cached) yes
checking whether byte ordering is bigendian... no
checking for an ANSI C-conforming const... yes
checking for inline... inline
checking for obstacks... yes
checking for off_t... make[6]: Leaving directory `/export/server/build-server/gcc-test/bld/build-x86_64-unknown-linux-gnu/libiberty'
make[5]: *** [all-build-libiberty] Error 2
yes
checking for size_t... yes
checking for ssize_t... yes
checking for uintptr_t... yes
checking for ptrdiff_t... yes
checking whether struct tm is in sys/time.h or time.h... time.h
checking size of int... 4
checking size of long... 8
checking for clearerr_unlocked... no
checking for feof_unlocked... no
checking for ferror_unlocked... no
checking for fflush_unlocked... no
checking for fgetc_unlocked... no
checking for fgets_unlocked... no
checking for fileno_unlocked... no
checking for fprintf_unlocked... no
checking for fputc_unlocked... no
checking for fputs_unlocked... no
checking for fread_unlocked... no
checking for fwrite_unlocked... no
checking for getchar_unlocked... no
checking for getc_unlocked... no
checking for putchar_unlocked... no
checking for putc_unlocked... no
checking whether abort is declared... yes
checking whether asprintf is declared... yes
checking whether basename is declared... yes
checking whether errno is declared... no
checking whether getopt is declared... yes
checking whether vasprintf is declared... yes
checking whether clearerr_unlocked is declared... yes
checking whether feof_unlocked is declared... yes
checking whether ferror_unlocked is declared... yes
checking whether fflush_unlocked is declared... yes
checking whether fgetc_unlocked is declared... yes
checking whether fgets_unlocked is declared... yes
checking whether fileno_unlocked is declared... yes
checking whether fprintf_unlocked is declared... no
checking whether fputc_unlocked is declared... yes
checking whether fputs_unlocked is declared... yes
checking whether fread_unlocked is declared... yes
checking whether fwrite_unlocked is declared... yes
checking whether getchar_unlocked is declared... yes
checking whether getc_unlocked is declared... yes
checking whether putchar_unlocked is declared... yes
checking whether putc_unlocked is declared... yes
checking for working alloca.h... yes
checking for alloca... yes
checking for ANSI C header files... (cached) yes
checking for nl_langinfo and CODESET... yes
checking whether NLS is requested... yes
checking for catalogs to be installed...  be ca da de el es fi fr id ja nl ru sv tr uk vi zh_CN zh_TW
checking for uchar... 
checking for ld used by GCC... /usr/local/lib/gcc/x86_64-unknown-linux-gnu/4.6.0/../../../../x86_64-unknown-linux-gnu/bin/ld
checking if the linker (/usr/local/lib/gcc/x86_64-unknown-linux-gnu/4.6.0/../../../../x86_64-unknown-linux-gnu/bin/ld) is GNU ld... yes
checking for shared library run path origin... done
checking for iconv... yes
checking for iconv declaration... install-shextern size_t iconv (iconv_t cd, char * *inbuf, size_t *inbytesleft, char * *outbuf, size_t *outbytesleft);
configure: updating cache ./config.cache
configure: creating ./config.status
config.status: creating Makefile
config.status: creating config.h
config.status: executing depdir commands
mkdir -p -- .deps
make[5]: Leaving directory `/export/server/build-server/gcc-test/bld'
make[4]: *** [stage1-bubble] Error 2
make[4]: Leaving directory `/export/server/build-server/gcc-test/bld'
make[3]: *** [bootstrap] Error 2
make[3]: Leaving directory `/export/server/build-server/gcc-test/bld'
19.68user 12.21system 0:09.93elapsed 321%CPU (0avgtext+0avgdata 118384maxresident)k
0inputs+50088outputs (0major+5745587minor)pagefaults 0swaps
make[2]: *** [bootstrap] Error 2
make[2]: Leaving directory `/export/server/build-server/gcc-test'



More information about the Gcc-regression mailing list