Gcc [trunk revision 170370] failed to bootstrap on x86_64!

H.J. Lu X86 SPEC CPU 2000/2006 x86spec@gnu-16.sc.intel.com
Tue Feb 22 01:12:00 GMT 2011


cd bld; \
 RUNTESTFLAGS="--target_board 'unix{-m32,}'" ../src-trunk/configure \
	 --prefix=/export/gnu/import/svn/gcc-test-spec/usr --enable-clocale=gnu --with-system-zlib --enable-shared --with-demangler-in-ld --enable-cloog-backend=isl --with-ppl-include=/opt/gnu/include --with-ppl-lib=/opt/gnu/lib64 --with-cloog-include=/opt/gnu/include --with-cloog-lib=/opt/gnu/lib64 --with-fpmath=sse --enable-languages=c,c++,fortran,lto
checking build system type... x86_64-unknown-linux-gnu
checking host system type... x86_64-unknown-linux-gnu
checking target system type... x86_64-unknown-linux-gnu
checking for a BSD-compatible install... /usr/bin/install -c
    grep "Error " makelog.170370.trunk.x86_64 >> makelog.170370.trunk.x86_64.mail; \
make[5]: *** [configure-stage1-target-libgomp] Error 1
make[4]: *** [stage1-bubble] Error 2
make[3]: *** [bootstrap] Error 2
make[2]: *** [bootstrap] Error 2
config.status: creating Makefile
config.status: creating testsuite/Makefile
config.status: creating libgomp.spec
config.status: creating config.h
config.status: executing default-1 commands
Adding multilib support to Makefile in ../../../src-trunk/libgomp
multidirs=32
with_multisubdir=
Running configure in multilib subdirs 32
pwd: /export/gnu/import/svn/gcc-test-spec/bld/x86_64-unknown-linux-gnu/libgomp
Running configure in multilib subdir 32
pwd: /export/gnu/import/svn/gcc-test-spec/bld/x86_64-unknown-linux-gnu
configure: creating cache ./config.cache
checking for --enable-version-specific-runtime-libs... no
checking for --enable-generated-files-in-srcdir... no
checking build system type... x86_64-unknown-linux-gnu
checking host system type... x86_64-unknown-linux-gnu
checking target system type... x86_64-unknown-linux-gnu
checking for a BSD-compatible install... /usr/bin/install -c
checking whether build environment is sane... yes
checking for a thread-safe mkdir -p... /bin/mkdir -p
checking for gawk... gawk
checking whether make sets $(MAKE)... yes
checking for x86_64-unknown-linux-gnu-gcc... /export/gnu/import/svn/gcc-test-spec/bld/./gcc/xgcc -B/export/gnu/import/svn/gcc-test-spec/bld/./gcc/ -B/export/gnu/import/svn/gcc-test-spec/usr/x86_64-unknown-linux-gnu/bin/ -B/export/gnu/import/svn/gcc-test-spec/usr/x86_64-unknown-linux-gnu/lib/ -isystem /export/gnu/import/svn/gcc-test-spec/usr/x86_64-unknown-linux-gnu/include -isystem /export/gnu/import/svn/gcc-test-spec/usr/x86_64-unknown-linux-gnu/sys-include  -m32
checking for C compiler default output file name... a.out
checking whether the C compiler works... yes
checking whether we are cross compiling... no
checking for suffix of executables... 
checking for suffix of object files... o
checking whether we are using the GNU C compiler... yes
checking whether /export/gnu/import/svn/gcc-test-spec/bld/./gcc/xgcc -B/export/gnu/import/svn/gcc-test-spec/bld/./gcc/ -B/export/gnu/import/svn/gcc-test-spec/usr/x86_64-unknown-linux-gnu/bin/ -B/export/gnu/import/svn/gcc-test-spec/usr/x86_64-unknown-linux-gnu/lib/ -isystem /export/gnu/import/svn/gcc-test-spec/usr/x86_64-unknown-linux-gnu/include -isystem /export/gnu/import/svn/gcc-test-spec/usr/x86_64-unknown-linux-gnu/sys-include  -m32 accepts -g... yes
checking for /export/gnu/import/svn/gcc-test-spec/bld/./gcc/xgcc -B/export/gnu/import/svn/gcc-test-spec/bld/./gcc/ -B/export/gnu/import/svn/gcc-test-spec/usr/x86_64-unknown-linux-gnu/bin/ -B/export/gnu/import/svn/gcc-test-spec/usr/x86_64-unknown-linux-gnu/lib/ -isystem /export/gnu/import/svn/gcc-test-spec/usr/x86_64-unknown-linux-gnu/include -isystem /export/gnu/import/svn/gcc-test-spec/usr/x86_64-unknown-linux-gnu/sys-include  -m32 option to accept ISO C89... none needed
checking for style of include used by make... GNU
checking dependency style of /export/gnu/import/svn/gcc-test-spec/bld/./gcc/xgcc -B/export/gnu/import/svn/gcc-test-spec/bld/./gcc/ -B/export/gnu/import/svn/gcc-test-spec/usr/x86_64-unknown-linux-gnu/bin/ -B/export/gnu/import/svn/gcc-test-spec/usr/x86_64-unknown-linux-gnu/lib/ -isystem /export/gnu/import/svn/gcc-test-spec/usr/x86_64-unknown-linux-gnu/include -isystem /export/gnu/import/svn/gcc-test-spec/usr/x86_64-unknown-linux-gnu/sys-include  -m32... gcc3
checking for x86_64-unknown-linux-gnu-ar... ar
checking for x86_64-unknown-linux-gnu-ranlib... ranlib
checking for perl... /usr/bin/perl
checking whether make sets $(MAKE)... (cached) yes
checking for makeinfo... makeinfo --split-size=5000000 --split-size=5000000
checking for modern makeinfo... yes
checking how to print strings... printf
checking for a sed that does not truncate output... /bin/sed
checking for grep that handles long lines and -e... /bin/grep
checking for egrep... /bin/grep -E
checking for fgrep... /bin/grep -F
checking for ld used by /export/gnu/import/svn/gcc-test-spec/bld/./gcc/xgcc -B/export/gnu/import/svn/gcc-test-spec/bld/./gcc/ -B/export/gnu/import/svn/gcc-test-spec/usr/x86_64-unknown-linux-gnu/bin/ -B/export/gnu/import/svn/gcc-test-spec/usr/x86_64-unknown-linux-gnu/lib/ -isystem /export/gnu/import/svn/gcc-test-spec/usr/x86_64-unknown-linux-gnu/include -isystem /export/gnu/import/svn/gcc-test-spec/usr/x86_64-unknown-linux-gnu/sys-include  -m32... /export/gnu/import/svn/gcc-test-spec/bld/./gcc/collect-ld
checking if the linker (/export/gnu/import/svn/gcc-test-spec/bld/./gcc/collect-ld) is GNU ld... yes
checking for BSD- or MS-compatible name lister (nm)... /export/gnu/import/svn/gcc-test-spec/bld/./gcc/nm
checking the name lister (/export/gnu/import/svn/gcc-test-spec/bld/./gcc/nm) interface... BSD nm
checking whether ln -s works... yes
checking the maximum length of command line arguments... 1572864
checking whether the shell understands some XSI constructs... yes
checking whether the shell understands "+="... yes
checking for /export/gnu/import/svn/gcc-test-spec/bld/./gcc/collect-ld option to reload object files... -r
checking for x86_64-unknown-linux-gnu-objdump... objdump
checking how to recognize dependent libraries... pass_all
checking for x86_64-unknown-linux-gnu-ar... (cached) ar
checking for x86_64-unknown-linux-gnu-strip... strip
checking for x86_64-unknown-linux-gnu-ranlib... (cached) ranlib
checking command to parse /export/gnu/import/svn/gcc-test-spec/bld/./gcc/nm output from /export/gnu/import/svn/gcc-test-spec/bld/./gcc/xgcc -B/export/gnu/import/svn/gcc-test-spec/bld/./gcc/ -B/export/gnu/import/svn/gcc-test-spec/usr/x86_64-unknown-linux-gnu/bin/ -B/export/gnu/import/svn/gcc-test-spec/usr/x86_64-unknown-linux-gnu/lib/ -isystem /export/gnu/import/svn/gcc-test-spec/usr/x86_64-unknown-linux-gnu/include -isystem /export/gnu/import/svn/gcc-test-spec/usr/x86_64-unknown-linux-gnu/sys-include  -m32 object... ../../../../src-trunk/libgomp/configure: line 6410: cannot create temp file for here-document: No space left on device
../../../../src-trunk/libgomp/configure: line 6419: cannot create temp file for here-document: No space left on device
../../../../src-trunk/libgomp/configure: line 6431: cannot create temp file for here-document: No space left on device
../../../../src-trunk/libgomp/configure: line 6375: cannot create temp file for here-document: No space left on device
failed
checking how to run the C preprocessor... ../../../../src-trunk/libgomp/configure: line 7354: cannot create temp file for here-document: No space left on device
sed: can't read conftest.c: No such file or directory
../../../../src-trunk/libgomp/configure: line 7354: cannot create temp file for here-document: No space left on device
sed: can't read conftest.c: No such file or directory
../../../../src-trunk/libgomp/configure: line 7354: cannot create temp file for here-document: No space left on device
sed: can't read conftest.c: No such file or directory
../../../../src-trunk/libgomp/configure: line 7354: cannot create temp file for here-document: No space left on device
sed: can't read conftest.c: No such file or directory
../../../../src-trunk/libgomp/configure: line 7354: cannot create temp file for here-document: No space left on device
sed: can't read conftest.c: No such file or directory
../../../../src-trunk/libgomp/configure: line 7354: cannot create temp file for here-document: No space left on device
sed: can't read conftest.c: No such file or directory
/lib/cpp
../../../../src-trunk/libgomp/configure: line 7413: cannot create temp file for here-document: No space left on device
sed: can't read conftest.c: No such file or directory
../../../../src-trunk/libgomp/configure: line 7413: cannot create temp file for here-document: No space left on device
sed: can't read conftest.c: No such file or directory
configure: error: in `/export/gnu/import/svn/gcc-test-spec/bld/x86_64-unknown-linux-gnu/32/libgomp':
configure: error: C preprocessor "/lib/cpp" fails sanity check
See `config.log' for more details.
../../../../src-trunk/libgomp/configure: line 6: cannot create temp file for here-document: No space left on device
../../../../src-trunk/libgomp/configure: line 44: cannot create temp file for here-document: No space left on device
../../../../src-trunk/libgomp/configure: line 79: cannot create temp file for here-document: No space left on device
/export/gnu/import/svn/gcc-test-spec/src-trunk/libgomp/configure: line 6: cannot create temp file for here-document: No space left on device
/export/gnu/import/svn/gcc-test-spec/src-trunk/libgomp/configure: line 44: cannot create temp file for here-document: No space left on device
/export/gnu/import/svn/gcc-test-spec/src-trunk/libgomp/configure: line 79: cannot create temp file for here-document: No space left on device
make[5]: *** [configure-stage1-target-libgomp] Error 1
make[5]: Leaving directory `/export/gnu/import/svn/gcc-test-spec/bld'
make[4]: *** [stage1-bubble] Error 2
make[4]: Leaving directory `/export/gnu/import/svn/gcc-test-spec/bld'
make[3]: *** [bootstrap] Error 2
make[3]: Leaving directory `/export/gnu/import/svn/gcc-test-spec/bld'
843.85user 120.97system 4:55:33elapsed 5%CPU (0avgtext+0avgdata 1357760maxresident)k
5170168inputs+4179256outputs (29671major+27098561minor)pagefaults 0swaps
make[2]: *** [bootstrap] Error 2
make[2]: Leaving directory `/export/gnu/import/svn/gcc-test-spec'



More information about the Gcc-regression mailing list