Gcc [trunk revision 170274] failed to bootstrap on x86_64!

H.J. Lu Intel64-bootstrap-lto hjl@gnu-68.sc.intel.com
Fri Feb 18 17:27:00 GMT 2011


cd bld; \
 RUNTESTFLAGS="--target_board='unix{-m32,}'" ../src-trunk/configure \
	 --enable-clocale=gnu --with-system-zlib --enable-shared --with-demangler-in-ld --enable-cloog-backend=isl --with-ppl-include=/opt/gnu/include --with-ppl-lib=/opt/gnu/lib64 --with-cloog-include=/opt/gnu/include --with-cloog-lib=/opt/gnu/lib64 --with-build-config=bootstrap-lto --with-fpmath=sse --enable-languages=c,c++,fortran,java,lto,objc
checking build system type... x86_64-unknown-linux-gnu
checking host system type... x86_64-unknown-linux-gnu
checking target system type... x86_64-unknown-linux-gnu
checking for a BSD-compatible install... /usr/bin/install -c
    grep "Error " makelog.170274.trunk.x86_64 >> makelog.170274.trunk.x86_64.mail; \
make[6]: *** [lto/lto-lang.o] Error 1
make[5]: *** [all-stage1-gcc] Error 2
make[4]: *** [stage1-bubble] Error 2
make[3]: *** [bootstrap] Error 2
make[2]: *** [bootstrap] Error 2
gcc   -g -fkeep-inline-functions -DIN_GCC   -W -Wall -Wwrite-strings -Wcast-qual -Wstrict-prototypes -Wmissing-prototypes -Wmissing-format-attribute -pedantic -Wno-long-long -Wno-variadic-macros -Wno-overlength-strings -Wold-style-definition -Wc++-compat -fno-common  -DHAVE_CONFIG_H -DGENERATOR_FILE  -o build/genemit \
    build/genemit.o build/rtl.o build/read-rtl.o build/ggc-none.o build/vec.o build/min-insn-modes.o build/gensupport.o build/print-rtl.o build/read-md.o build/errors.o ../build-x86_64-unknown-linux-gnu/libiberty/libiberty.a
gcc   -g -fkeep-inline-functions -DIN_GCC   -W -Wall -Wwrite-strings -Wcast-qual -Wstrict-prototypes -Wmissing-prototypes -Wmissing-format-attribute -pedantic -Wno-long-long -Wno-variadic-macros -Wno-overlength-strings -Wold-style-definition -Wc++-compat -fno-common  -DHAVE_CONFIG_H -DGENERATOR_FILE  -o build/genextract \
    build/genextract.o build/rtl.o build/read-rtl.o build/ggc-none.o build/vec.o build/min-insn-modes.o build/gensupport.o build/print-rtl.o build/read-md.o build/errors.o ../build-x86_64-unknown-linux-gnu/libiberty/libiberty.a
gcc   -g -fkeep-inline-functions -DIN_GCC   -W -Wall -Wwrite-strings -Wcast-qual -Wstrict-prototypes -Wmissing-prototypes -Wmissing-format-attribute -pedantic -Wno-long-long -Wno-variadic-macros -Wno-overlength-strings -Wold-style-definition -Wc++-compat -fno-common  -DHAVE_CONFIG_H -DGENERATOR_FILE  -o build/genopinit \
    build/genopinit.o build/rtl.o build/read-rtl.o build/ggc-none.o build/vec.o build/min-insn-modes.o build/gensupport.o build/print-rtl.o build/read-md.o build/errors.o ../build-x86_64-unknown-linux-gnu/libiberty/libiberty.a
gcc   -g -fkeep-inline-functions -DIN_GCC   -W -Wall -Wwrite-strings -Wcast-qual -Wstrict-prototypes -Wmissing-prototypes -Wmissing-format-attribute -pedantic -Wno-long-long -Wno-variadic-macros -Wno-overlength-strings -Wold-style-definition -Wc++-compat -fno-common  -DHAVE_CONFIG_H -DGENERATOR_FILE  -o build/genoutput \
    build/genoutput.o build/rtl.o build/read-rtl.o build/ggc-none.o build/vec.o build/min-insn-modes.o build/gensupport.o build/print-rtl.o build/read-md.o build/errors.o ../build-x86_64-unknown-linux-gnu/libiberty/libiberty.a
gcc   -g -fkeep-inline-functions -DIN_GCC   -W -Wall -Wwrite-strings -Wcast-qual -Wstrict-prototypes -Wmissing-prototypes -Wmissing-format-attribute -pedantic -Wno-long-long -Wno-variadic-macros -Wno-overlength-strings -Wold-style-definition -Wc++-compat -fno-common  -DHAVE_CONFIG_H -DGENERATOR_FILE  -o build/genpeep \
    build/genpeep.o build/rtl.o build/read-rtl.o build/ggc-none.o build/vec.o build/min-insn-modes.o build/gensupport.o build/print-rtl.o build/read-md.o build/errors.o ../build-x86_64-unknown-linux-gnu/libiberty/libiberty.a
build/genpreds ../../src-trunk/gcc/config/i386/i386.md > tmp-preds.c
gcc   -g -fkeep-inline-functions -DIN_GCC   -W -Wall -Wwrite-strings -Wcast-qual -Wstrict-prototypes -Wmissing-prototypes -Wmissing-format-attribute -pedantic -Wno-long-long -Wno-variadic-macros -Wno-overlength-strings -Wold-style-definition -Wc++-compat -fno-common  -DHAVE_CONFIG_H -DGENERATOR_FILE  -o build/genrecog \
    build/genrecog.o build/rtl.o build/read-rtl.o build/ggc-none.o build/vec.o build/min-insn-modes.o build/gensupport.o build/print-rtl.o build/read-md.o build/errors.o ../build-x86_64-unknown-linux-gnu/libiberty/libiberty.a
build/genconditions ../../src-trunk/gcc/config/i386/i386.md > tmp-condmd.c
/bin/sh ../../src-trunk/gcc/../move-if-change tmp-preds.c insn-preds.c
echo timestamp > s-preds
build/genpreds -h ../../src-trunk/gcc/config/i386/i386.md > tmp-preds.h
/bin/sh ../../src-trunk/gcc/../move-if-change tmp-condmd.c build/gencondmd.c
echo timestamp > s-conditions
build/genpreds -c ../../src-trunk/gcc/config/i386/i386.md > tmp-constrs.h
/bin/sh ../../src-trunk/gcc/../move-if-change tmp-preds.h tm-preds.h
echo timestamp > s-preds-h
/bin/sh ../../src-trunk/gcc/../move-if-change tmp-constrs.h tm-constrs.h
echo timestamp > s-constrs-h
gcc -c -g -DIN_GCC -W -Wall -Wwrite-strings -Wcast-qual -Wstrict-prototypes -Wmissing-prototypes -Wold-style-definition -Wc++-compat -fno-common -DHAVE_CONFIG_H -DGENERATOR_FILE -I. -Ibuild -I../../src-trunk/gcc -I../../src-trunk/gcc/build -I../../src-trunk/gcc/../include -I../../src-trunk/gcc/../libcpp/include  -I../../src-trunk/gcc/../libdecnumber -I../../src-trunk/gcc/../libdecnumber/bid -I../libdecnumber -I/opt/gnu/include  -I/opt/gnu/include -DCLOOG_INT_GMP -DCLOOG_ORG  \
	-o build/gencondmd.o build/gencondmd.c
gcc   -g -fkeep-inline-functions -DIN_GCC   -W -Wall -Wwrite-strings -Wcast-qual -Wstrict-prototypes -Wmissing-prototypes -Wmissing-format-attribute -pedantic -Wno-long-long -Wno-variadic-macros -Wno-overlength-strings -Wold-style-definition -Wc++-compat -fno-common  -DHAVE_CONFIG_H -DGENERATOR_FILE  -o build/gencondmd \
    build/gencondmd.o ../build-x86_64-unknown-linux-gnu/libiberty/libiberty.a
build/gencondmd > tmp-cond.md
/bin/sh ../../src-trunk/gcc/../move-if-change tmp-cond.md insn-conditions.md
echo timestamp > s-condmd
build/genflags ../../src-trunk/gcc/config/i386/i386.md \
  insn-conditions.md > tmp-flags.h
build/genattr ../../src-trunk/gcc/config/i386/i386.md \
  insn-conditions.md > tmp-attr.h
/bin/sh ../../src-trunk/gcc/../move-if-change tmp-attr.h insn-attr.h
/bin/sh ../../src-trunk/gcc/../move-if-change tmp-flags.h insn-flags.h
echo timestamp > s-attr
build/gencodes ../../src-trunk/gcc/config/i386/i386.md \
  insn-conditions.md > tmp-codes.h
echo timestamp > s-flags
build/genconfig ../../src-trunk/gcc/config/i386/i386.md \
  insn-conditions.md > tmp-config.h
/bin/sh ../../src-trunk/gcc/../move-if-change tmp-codes.h insn-codes.h
/bin/sh ../../src-trunk/gcc/../move-if-change tmp-config.h insn-config.h
echo timestamp > s-codes
build/genattrtab ../../src-trunk/gcc/config/i386/i386.md \
  insn-conditions.md > tmp-attrtab.c
echo timestamp > s-config
build/genautomata ../../src-trunk/gcc/config/i386/i386.md \
  insn-conditions.md > tmp-automata.c
/bin/sh ../../src-trunk/gcc/../move-if-change tmp-attrtab.c insn-attrtab.c
echo timestamp > s-attrtab
build/genemit ../../src-trunk/gcc/config/i386/i386.md \
  insn-conditions.md > tmp-emit.c
/bin/sh ../../src-trunk/gcc/../move-if-change tmp-emit.c insn-emit.c
echo timestamp > s-emit
build/genextract ../../src-trunk/gcc/config/i386/i386.md \
  insn-conditions.md > tmp-extract.c
/bin/sh ../../src-trunk/gcc/../move-if-change tmp-extract.c insn-extract.c
echo timestamp > s-extract
build/genopinit ../../src-trunk/gcc/config/i386/i386.md \
  insn-conditions.md > tmp-opinit.c
/bin/sh ../../src-trunk/gcc/../move-if-change tmp-opinit.c insn-opinit.c
echo timestamp > s-opinit
build/genoutput ../../src-trunk/gcc/config/i386/i386.md \
  insn-conditions.md > tmp-output.c
/bin/sh ../../src-trunk/gcc/../move-if-change tmp-output.c insn-output.c
echo timestamp > s-output
build/genpeep ../../src-trunk/gcc/config/i386/i386.md \
  insn-conditions.md > tmp-peep.c
/bin/sh ../../src-trunk/gcc/../move-if-change tmp-peep.c insn-peep.c
echo timestamp > s-peep
build/genrecog ../../src-trunk/gcc/config/i386/i386.md \
  insn-conditions.md > tmp-recog.c
/bin/sh ../../src-trunk/gcc/../move-if-change tmp-recog.c insn-recog.c
echo timestamp > s-recog
gcc -c   -g -fkeep-inline-functions -DIN_GCC   -W -Wall -Wwrite-strings -Wcast-qual -Wstrict-prototypes -Wmissing-prototypes -Wmissing-format-attribute -pedantic -Wno-long-long -Wno-variadic-macros -Wno-overlength-strings -Wold-style-definition -Wc++-compat -fno-common  -DHAVE_CONFIG_H -DGENERATOR_FILE -I. -Ibuild -I../../src-trunk/gcc -I../../src-trunk/gcc/build -I../../src-trunk/gcc/../include -I../../src-trunk/gcc/../libcpp/include  -I../../src-trunk/gcc/../libdecnumber -I../../src-trunk/gcc/../libdecnumber/bid -I../libdecnumber -I/opt/gnu/include  -I/opt/gnu/include -DCLOOG_INT_GMP -DCLOOG_ORG  \
	-o build/gcov-iov.o ../../src-trunk/gcc/gcov-iov.c
gcc -c   -g -fkeep-inline-functions -DIN_GCC   -W -Wall -Wwrite-strings -Wcast-qual -Wstrict-prototypes -Wmissing-prototypes -Wmissing-format-attribute -pedantic -Wno-long-long -Wno-variadic-macros -Wno-overlength-strings -Wold-style-definition -Wc++-compat -fno-common  -DHAVE_CONFIG_H -I. -Ilto -I../../src-trunk/gcc -I../../src-trunk/gcc/lto -I../../src-trunk/gcc/../include -I../../src-trunk/gcc/../libcpp/include  -I../../src-trunk/gcc/../libdecnumber -I../../src-trunk/gcc/../libdecnumber/bid -I../libdecnumber -I/opt/gnu/include  -I/opt/gnu/include -DCLOOG_INT_GMP -DCLOOG_ORG  ../../src-trunk/gcc/lto/lto-lang.c -o lto/lto-lang.o
In file included from ../../src-trunk/gcc/lto-streamer.h:34:0,
                 from ../../src-trunk/gcc/lto/lto-lang.c:37:
../../src-trunk/gcc/gcov-io.h:282:22: fatal error: gcov-iov.h: No such file or directory
compilation terminated.
make[6]: *** [lto/lto-lang.o] Error 1
make[6]: *** Waiting for unfinished jobs....
/bin/sh ../../src-trunk/gcc/../move-if-change tmp-automata.c insn-automata.c
echo timestamp > s-automata
rm gcov.pod cpp.pod gcc.pod fsf-funding.pod gfdl.pod
make[6]: Leaving directory `/export/gnu/import/svn/gcc-test/bld/gcc'
make[5]: *** [all-stage1-gcc] Error 2
make[5]: Leaving directory `/export/gnu/import/svn/gcc-test/bld'
make[4]: *** [stage1-bubble] Error 2
make[4]: Leaving directory `/export/gnu/import/svn/gcc-test/bld'
make[3]: *** [bootstrap] Error 2
make[3]: Leaving directory `/export/gnu/import/svn/gcc-test/bld'
105.52user 40.58system 1:33.28elapsed 156%CPU (0avgtext+0avgdata 1206624maxresident)k
120752inputs+268456outputs (57major+9465760minor)pagefaults 0swaps
make[2]: *** [bootstrap] Error 2
make[2]: Leaving directory `/export/gnu/import/svn/gcc-test'



More information about the Gcc-regression mailing list