GCC build failure, HEAD@170102 on native

GCC regression tester regress@geoffk.org
Sun Feb 13 09:01:00 GMT 2011


With your recent patch, GCC HEAD revision 170102 had problems on:
native: build (about the same as the previous build)
Attached is build output for those targets.
The previous build was of revision 170101.

Log information for changes since the last build:
------------------------------------------------------------------------
r170102 | mrs | 2011-02-13 00:43:07 -0800 (Sun, 13 Feb 2011) | 3 lines
Changed paths:
   M /trunk/gcc/cp/ChangeLog
   M /trunk/gcc/cp/Make-lang.in

	* Make-lang.in (cp/parser.o): Move c-family/c-objc.h dependancy
	down.

------------------------------------------------------------------------

For more information, see <http://glutton.geoffk.org/HEAD/>.

-------------- next part --------------
/home/regress/tbox/native/build/./prev-gcc/xgcc -B/home/regress/tbox/native/build/./prev-gcc/ -B/home/regress/tbox/objs/i686-pc-linux-gnu/bin/ -B/home/regress/tbox/objs/i686-pc-linux-gnu/bin/ -B/home/regress/tbox/objs/i686-pc-linux-gnu/lib/ -isystem /home/regress/tbox/objs/i686-pc-linux-gnu/include -isystem /home/regress/tbox/objs/i686-pc-linux-gnu/sys-include    -c  -DIN_GCC_FRONTEND -g -O2 -fomit-frame-pointer -gtoggle -DIN_GCC   -W -Wall -Wwrite-strings -Wcast-qual -Wstrict-prototypes -Wmissing-prototypes -Wmissing-format-attribute -pedantic -Wno-long-long -Wno-variadic-macros -Wno-overlength-strings -Werror -Wold-style-definition -Wc++-compat -fno-common  -DHAVE_CONFIG_H -I. -Icp -I/home/regress/tbox/svn-gcc/gcc -I/home/regress/tbox/svn-gcc/gcc/cp -I/home/regress/tbox/svn-gcc/gcc/../include -I/home/regress/tbox/svn-gcc/gcc/../libcpp/include  -I/home/regress/tbox/svn-gcc/gcc/../libdecnumber -I/home/regress/tbox/svn-gcc/gcc/../libdecnumber/bid -I../libdecnumber    /home/re!
 gress/tbox/svn-gcc/gcc/cp/lex.c -o cp/lex.o
/home/regress/tbox/native/build/./prev-gcc/xgcc -B/home/regress/tbox/native/build/./prev-gcc/ -B/home/regress/tbox/objs/i686-pc-linux-gnu/bin/ -B/home/regress/tbox/objs/i686-pc-linux-gnu/bin/ -B/home/regress/tbox/objs/i686-pc-linux-gnu/lib/ -isystem /home/regress/tbox/objs/i686-pc-linux-gnu/include -isystem /home/regress/tbox/objs/i686-pc-linux-gnu/sys-include    -c  -DIN_GCC_FRONTEND -g -O2 -fomit-frame-pointer -gtoggle -DIN_GCC   -W -Wall -Wwrite-strings -Wcast-qual -Wstrict-prototypes -Wmissing-prototypes -Wmissing-format-attribute -pedantic -Wno-long-long -Wno-variadic-macros -Wno-overlength-strings -Werror -Wold-style-definition -Wc++-compat -fno-common  -DHAVE_CONFIG_H -I. -Icp -I/home/regress/tbox/svn-gcc/gcc -I/home/regress/tbox/svn-gcc/gcc/cp -I/home/regress/tbox/svn-gcc/gcc/../include -I/home/regress/tbox/svn-gcc/gcc/../libcpp/include  -I/home/regress/tbox/svn-gcc/gcc/../libdecnumber -I/home/regress/tbox/svn-gcc/gcc/../libdecnumber/bid -I../libdecnumber    /home/re!
 gress/tbox/svn-gcc/gcc/cp/parser.c -o cp/parser.o
/home/regress/tbox/native/build/./prev-gcc/xgcc -B/home/regress/tbox/native/build/./prev-gcc/ -B/home/regress/tbox/objs/i686-pc-linux-gnu/bin/ -B/home/regress/tbox/objs/i686-pc-linux-gnu/bin/ -B/home/regress/tbox/objs/i686-pc-linux-gnu/lib/ -isystem /home/regress/tbox/objs/i686-pc-linux-gnu/include -isystem /home/regress/tbox/objs/i686-pc-linux-gnu/sys-include    -c  -DIN_GCC_FRONTEND -g -O2 -fomit-frame-pointer -gtoggle -DIN_GCC   -W -Wall -Wwrite-strings -Wcast-qual -Wstrict-prototypes -Wmissing-prototypes -Wmissing-format-attribute -pedantic -Wno-long-long -Wno-variadic-macros -Wno-overlength-strings -Werror -Wold-style-definition -Wc++-compat -fno-common  -DHAVE_CONFIG_H -I. -Icp -I/home/regress/tbox/svn-gcc/gcc -I/home/regress/tbox/svn-gcc/gcc/cp -I/home/regress/tbox/svn-gcc/gcc/../include -I/home/regress/tbox/svn-gcc/gcc/../libcpp/include  -I/home/regress/tbox/svn-gcc/gcc/../libdecnumber -I/home/regress/tbox/svn-gcc/gcc/../libdecnumber/bid -I../libdecnumber    /home/re!
 gress/tbox/svn-gcc/gcc/cp/ptree.c -o cp/ptree.o
/home/regress/tbox/native/build/./prev-gcc/xgcc -B/home/regress/tbox/native/build/./prev-gcc/ -B/home/regress/tbox/objs/i686-pc-linux-gnu/bin/ -B/home/regress/tbox/objs/i686-pc-linux-gnu/bin/ -B/home/regress/tbox/objs/i686-pc-linux-gnu/lib/ -isystem /home/regress/tbox/objs/i686-pc-linux-gnu/include -isystem /home/regress/tbox/objs/i686-pc-linux-gnu/sys-include    -c  -DIN_GCC_FRONTEND -g -O2 -fomit-frame-pointer -gtoggle -DIN_GCC   -W -Wall -Wwrite-strings -Wcast-qual -Wstrict-prototypes -Wmissing-prototypes -Wmissing-format-attribute -pedantic -Wno-long-long -Wno-variadic-macros -Wno-overlength-strings -Werror -Wold-style-definition -Wc++-compat -fno-common  -DHAVE_CONFIG_H -I. -Icp -I/home/regress/tbox/svn-gcc/gcc -I/home/regress/tbox/svn-gcc/gcc/cp -I/home/regress/tbox/svn-gcc/gcc/../include -I/home/regress/tbox/svn-gcc/gcc/../libcpp/include  -I/home/regress/tbox/svn-gcc/gcc/../libdecnumber -I/home/regress/tbox/svn-gcc/gcc/../libdecnumber/bid -I../libdecnumber    /home/re!
 gress/tbox/svn-gcc/gcc/cp/rtti.c -o cp/rtti.o
/home/regress/tbox/svn-gcc/gcc/cp/parser.c: In function 'cp_parser_declaration':
/home/regress/tbox/svn-gcc/gcc/cp/parser.c:9328:8: error: unused variable 'attributes' [-Werror=unused-variable]
/home/regress/tbox/native/build/./prev-gcc/xgcc -B/home/regress/tbox/native/build/./prev-gcc/ -B/home/regress/tbox/objs/i686-pc-linux-gnu/bin/ -B/home/regress/tbox/objs/i686-pc-linux-gnu/bin/ -B/home/regress/tbox/objs/i686-pc-linux-gnu/lib/ -isystem /home/regress/tbox/objs/i686-pc-linux-gnu/include -isystem /home/regress/tbox/objs/i686-pc-linux-gnu/sys-include    -c  -DIN_GCC_FRONTEND -g -O2 -fomit-frame-pointer -gtoggle -DIN_GCC   -W -Wall -Wwrite-strings -Wcast-qual -Wstrict-prototypes -Wmissing-prototypes -Wmissing-format-attribute -pedantic -Wno-long-long -Wno-variadic-macros -Wno-overlength-strings -Werror -Wold-style-definition -Wc++-compat -fno-common  -DHAVE_CONFIG_H -I. -Icp -I/home/regress/tbox/svn-gcc/gcc -I/home/regress/tbox/svn-gcc/gcc/cp -I/home/regress/tbox/svn-gcc/gcc/../include -I/home/regress/tbox/svn-gcc/gcc/../libcpp/include  -I/home/regress/tbox/svn-gcc/gcc/../libdecnumber -I/home/regress/tbox/svn-gcc/gcc/../libdecnumber/bid -I../libdecnumber    /home/re!
 gress/tbox/svn-gcc/gcc/cp/typeck.c -o cp/typeck.o
cc1: all warnings being treated as errors

make[3]: *** [cp/parser.o] Error 1
make[3]: *** Waiting for unfinished jobs....
rm gcj-dbtool.pod jcf-dump.pod jv-convert.pod grmic.pod gcov.pod gcj.pod gc-analyze.pod gfdl.pod cpp.pod gij.pod gfortran.pod fsf-funding.pod gcc.pod
make[3]: Leaving directory `/home/regress/tbox/native/build/gcc'
make[2]: *** [all-stage2-gcc] Error 2
make[2]: Leaving directory `/home/regress/tbox/native/build'
make[1]: *** [stage2-bubble] Error 2
make[1]: Leaving directory `/home/regress/tbox/native/build'
make: *** [bootstrap] Error 2
+ '[' -s .bad_compare ']'
+ exit 1
-------------- next part --------------

-- 
Geoffrey Keating <geoffk@geoffk.org> 
(via an automated GCC regression-testing script.)


More information about the Gcc-regression mailing list