NEW GCC build failure, HEAD@164616 on native

GCC regression tester regress@geoffk.org
Sat Sep 25 06:11:00 GMT 2010


With your recent patch, GCC HEAD revision 164616 had problems on:
native: build (NEW build failure)
Attached is build output for those targets.
The previous build was of revision 164615.

Log information for changes since the last build:
------------------------------------------------------------------------
r164616 | kargl | 2010-09-24 22:55:59 -0700 (Fri, 24 Sep 2010) | 9 lines
Changed paths:
   M /trunk/gcc/fortran/ChangeLog
   M /trunk/gcc/fortran/interface.c
   M /trunk/gcc/testsuite/ChangeLog
   A /trunk/gcc/testsuite/gfortran.dg/operator_c1202.f90

2010-09-24  Steven G. Kargl  < kargl@gcc.gnu.org>

	* fortran/interface.c (gfc_match_end_interface): Deal with user defined
	operators that overload rational operators and C1202.

2010-09-24  Steven G. Kargl  < kargl@gcc.gnu.org>

	* testsuite/gfortran.dg/operator_c1202.f90: New test.

------------------------------------------------------------------------

For more information, see <http://glutton.geoffk.org/HEAD/>.

-------------- next part --------------
/home/regress/tbox/native/build/./prev-gcc/xgcc -B/home/regress/tbox/native/build/./prev-gcc/ -B/home/regress/tbox/objs/i686-pc-linux-gnu/bin/ -B/home/regress/tbox/objs/i686-pc-linux-gnu/bin/ -B/home/regress/tbox/objs/i686-pc-linux-gnu/lib/ -isystem /home/regress/tbox/objs/i686-pc-linux-gnu/include -isystem /home/regress/tbox/objs/i686-pc-linux-gnu/sys-include    -c  -DIN_GCC_FRONTEND -g -O2 -fomit-frame-pointer -gtoggle -DIN_GCC   -W -Wall -Wwrite-strings -Wcast-qual -Wstrict-prototypes -Wmissing-prototypes -Wmissing-format-attribute -pedantic -Wno-long-long -Wno-variadic-macros -Wno-overlength-strings -Werror -Wold-style-definition -Wc++-compat -fno-common  -DHAVE_CONFIG_H -I. -Ifortran -I/home/regress/tbox/svn-gcc/gcc -I/home/regress/tbox/svn-gcc/gcc/fortran -I/home/regress/tbox/svn-gcc/gcc/../include -I/home/regress/tbox/svn-gcc/gcc/../libcpp/include  -I/home/regress/tbox/svn-gcc/gcc/../libdecnumber -I/home/regress/tbox/svn-gcc/gcc/../libdecnumber/bid -I../libdecnumber  !
  -I/usr/include/libelf  /home/regress/tbox/svn-gcc/gcc/fortran/dump-parse-tree.c -o fortran/dump-parse-tree.o
/home/regress/tbox/native/build/./prev-gcc/xgcc -B/home/regress/tbox/native/build/./prev-gcc/ -B/home/regress/tbox/objs/i686-pc-linux-gnu/bin/ -B/home/regress/tbox/objs/i686-pc-linux-gnu/bin/ -B/home/regress/tbox/objs/i686-pc-linux-gnu/lib/ -isystem /home/regress/tbox/objs/i686-pc-linux-gnu/include -isystem /home/regress/tbox/objs/i686-pc-linux-gnu/sys-include    -c  -DIN_GCC_FRONTEND -g -O2 -fomit-frame-pointer -gtoggle -DIN_GCC   -W -Wall -Wwrite-strings -Wcast-qual -Wstrict-prototypes -Wmissing-prototypes -Wmissing-format-attribute -pedantic -Wno-long-long -Wno-variadic-macros -Wno-overlength-strings -Werror -Wold-style-definition -Wc++-compat -fno-common  -DHAVE_CONFIG_H -I. -Ifortran -I/home/regress/tbox/svn-gcc/gcc -I/home/regress/tbox/svn-gcc/gcc/fortran -I/home/regress/tbox/svn-gcc/gcc/../include -I/home/regress/tbox/svn-gcc/gcc/../libcpp/include  -I/home/regress/tbox/svn-gcc/gcc/../libdecnumber -I/home/regress/tbox/svn-gcc/gcc/../libdecnumber/bid -I../libdecnumber  !
  -I/usr/include/libelf  /home/regress/tbox/svn-gcc/gcc/fortran/error.c -o fortran/error.o
/home/regress/tbox/native/build/./prev-gcc/xgcc -B/home/regress/tbox/native/build/./prev-gcc/ -B/home/regress/tbox/objs/i686-pc-linux-gnu/bin/ -B/home/regress/tbox/objs/i686-pc-linux-gnu/bin/ -B/home/regress/tbox/objs/i686-pc-linux-gnu/lib/ -isystem /home/regress/tbox/objs/i686-pc-linux-gnu/include -isystem /home/regress/tbox/objs/i686-pc-linux-gnu/sys-include    -c  -DIN_GCC_FRONTEND -g -O2 -fomit-frame-pointer -gtoggle -DIN_GCC   -W -Wall -Wwrite-strings -Wcast-qual -Wstrict-prototypes -Wmissing-prototypes -Wmissing-format-attribute -pedantic -Wno-long-long -Wno-variadic-macros -Wno-overlength-strings -Werror -Wold-style-definition -Wc++-compat -fno-common  -DHAVE_CONFIG_H -I. -Ifortran -I/home/regress/tbox/svn-gcc/gcc -I/home/regress/tbox/svn-gcc/gcc/fortran -I/home/regress/tbox/svn-gcc/gcc/../include -I/home/regress/tbox/svn-gcc/gcc/../libcpp/include  -I/home/regress/tbox/svn-gcc/gcc/../libdecnumber -I/home/regress/tbox/svn-gcc/gcc/../libdecnumber/bid -I../libdecnumber  !
  -I/usr/include/libelf  /home/regress/tbox/svn-gcc/gcc/fortran/expr.c -o fortran/expr.o
/home/regress/tbox/native/build/./prev-gcc/xgcc -B/home/regress/tbox/native/build/./prev-gcc/ -B/home/regress/tbox/objs/i686-pc-linux-gnu/bin/ -B/home/regress/tbox/objs/i686-pc-linux-gnu/bin/ -B/home/regress/tbox/objs/i686-pc-linux-gnu/lib/ -isystem /home/regress/tbox/objs/i686-pc-linux-gnu/include -isystem /home/regress/tbox/objs/i686-pc-linux-gnu/sys-include    -c  -DIN_GCC_FRONTEND -g -O2 -fomit-frame-pointer -gtoggle -DIN_GCC   -W -Wall -Wwrite-strings -Wcast-qual -Wstrict-prototypes -Wmissing-prototypes -Wmissing-format-attribute -pedantic -Wno-long-long -Wno-variadic-macros -Wno-overlength-strings -Werror -Wold-style-definition -Wc++-compat -fno-common  -DHAVE_CONFIG_H -I. -Ifortran -I/home/regress/tbox/svn-gcc/gcc -I/home/regress/tbox/svn-gcc/gcc/fortran -I/home/regress/tbox/svn-gcc/gcc/../include -I/home/regress/tbox/svn-gcc/gcc/../libcpp/include  -I/home/regress/tbox/svn-gcc/gcc/../libdecnumber -I/home/regress/tbox/svn-gcc/gcc/../libdecnumber/bid -I../libdecnumber  !
  -I/usr/include/libelf  /home/regress/tbox/svn-gcc/gcc/fortran/interface.c -o fortran/interface.o
/home/regress/tbox/svn-gcc/gcc/fortran/interface.c: In function 'gfc_match_end_interface':
/home/regress/tbox/svn-gcc/gcc/fortran/interface.c:324:11: error: assignment discards 'const' qualifier from pointer target type [-Werror]
/home/regress/tbox/svn-gcc/gcc/fortran/interface.c:325:11: error: assignment discards 'const' qualifier from pointer target type [-Werror]
cc1: all warnings being treated as errors

make[3]: *** [fortran/interface.o] Error 1
make[3]: *** Waiting for unfinished jobs....
rm gcj-dbtool.pod jcf-dump.pod jv-convert.pod grmic.pod gcov.pod gcj.pod gc-analyze.pod gfdl.pod cpp.pod gij.pod gfortran.pod fsf-funding.pod gcc.pod
make[3]: Leaving directory `/home/regress/tbox/native/build/gcc'
make[2]: *** [all-stage2-gcc] Error 2
make[2]: Leaving directory `/home/regress/tbox/native/build'
make[1]: *** [stage2-bubble] Error 2
make[1]: Leaving directory `/home/regress/tbox/native/build'
make: *** [bootstrap] Error 2
+ '[' -s .bad_compare ']'
+ exit 1
-------------- next part --------------

-- 
Geoffrey Keating <geoffk@geoffk.org> 
(via an automated GCC regression-testing script.)


More information about the Gcc-regression mailing list