GCC build failure, HEAD@164591 on native

regress regress@apple.com
Fri Sep 24 13:43:00 GMT 2010


With your recent patch, GCC HEAD revision 164591 had problems on:
native: build (about the same as the previous build)
Attached is build output for those targets.
The previous build was of revision 164590.

Log information for changes since the last build:
------------------------------------------------------------------------
r164591 | rguenth | 2010-09-24 06:21:30 -0700 (Fri, 24 Sep 2010) | 8 lines
Changed paths:
   M /trunk/gcc/ChangeLog
   M /trunk/gcc/c-decl.c
   M /trunk/gcc/langhooks.c
   M /trunk/gcc/testsuite/ChangeLog
   M /trunk/gcc/testsuite/gcc.dg/lto/20091006-2_0.c

2010-09-24  Richard Guenther  <rguenther@suse.de>

	* c-decl.c (pop_scope): Always set file-scope DECL_CONTEXT.
	Make sure to not call set_type_context with error_mark_node.
	* langhooks.c (lhd_set_decl_assembler_name): Use DECL_FILE_SCOPE_P.

	* gcc.dg/lto/20091006-2_0.c: Prune warnings.

------------------------------------------------------------------------

For more information, see <http://gcc.gnu.org/regtest/HEAD/>.

-------------- next part --------------
gcc   -g -fkeep-inline-functions -DIN_GCC   -W -Wall -Wwrite-strings -Wcast-qual -Wstrict-prototypes -Wmissing-prototypes -Wmissing-format-attribute -pedantic -Wno-long-long -Wno-variadic-macros -Wno-overlength-strings -Wold-style-definition -Wc++-compat -fno-common  -DHAVE_CONFIG_H  gcov-dump.o version.o errors.o \
		../libcpp/libcpp.a ./../intl/libintl.a -liconv  ../libiberty/libiberty.a ../libdecnumber/libdecnumber.a  -o gcov-dump
gcc   -g -fkeep-inline-functions -DIN_GCC   -W -Wall -Wwrite-strings -Wcast-qual -Wstrict-prototypes -Wmissing-prototypes -Wmissing-format-attribute -pedantic -Wno-long-long -Wno-variadic-macros -Wno-overlength-strings -Wold-style-definition -Wc++-compat -fno-common  -DHAVE_CONFIG_H  -o Tcollect2 \
		collect2.o collect2-aix.o tlink.o intl.o version.o ../libcpp/libcpp.a ./../intl/libintl.a -liconv  ../libiberty/libiberty.a ../libdecnumber/libdecnumber.a  
mv -f Tcollect2 collect2
gcc   -g -fkeep-inline-functions -DIN_GCC   -W -Wall -Wwrite-strings -Wcast-qual -Wstrict-prototypes -Wmissing-prototypes -Wmissing-format-attribute -pedantic -Wno-long-long -Wno-variadic-macros -Wno-overlength-strings -Wold-style-definition -Wc++-compat -fno-common  -DHAVE_CONFIG_H  -o xgcc gcc.o opts-common.o gcc-options.o diagnostic.o pretty-print.o input.o \
	  gccspec.o intl.o prefix.o version.o driver-rs6000.o darwin-driver.o ../libcpp/libcpp.a ./../intl/libintl.a -liconv  ../libiberty/libiberty.a ../libdecnumber/libdecnumber.a 
gcc -c   -g -fkeep-inline-functions -DIN_GCC   -W -Wall -Wwrite-strings -Wcast-qual -Wstrict-prototypes -Wmissing-prototypes -Wmissing-format-attribute -pedantic -Wno-long-long -Wno-variadic-macros -Wno-overlength-strings -Wold-style-definition -Wc++-compat -fno-common  -DHAVE_CONFIG_H -I. -I. -I/Users/regress/tbox/svn-gcc/gcc -I/Users/regress/tbox/svn-gcc/gcc/. -I/Users/regress/tbox/svn-gcc/gcc/../include -I./../intl -I/Users/regress/tbox/svn-gcc/gcc/../libcpp/include  -I/Users/regress/tbox/svn-gcc/gcc/../libdecnumber -I/Users/regress/tbox/svn-gcc/gcc/../libdecnumber/dpd -I../libdecnumber     insn-automata.c -o insn-automata.o
gcc   -g -fkeep-inline-functions -DIN_GCC   -W -Wall -Wwrite-strings -Wcast-qual -Wstrict-prototypes -Wmissing-prototypes -Wmissing-format-attribute -pedantic -Wno-long-long -Wno-variadic-macros -Wno-overlength-strings -Wold-style-definition -Wc++-compat -fno-common  -DHAVE_CONFIG_H  -o cpp gcc.o opts-common.o gcc-options.o diagnostic.o pretty-print.o input.o \
	  cppspec.o intl.o prefix.o version.o driver-rs6000.o darwin-driver.o ../libcpp/libcpp.a ./../intl/libintl.a -liconv  ../libiberty/libiberty.a ../libdecnumber/libdecnumber.a 
/Users/regress/tbox/native/build/./gcc/xgcc -B/Users/regress/tbox/native/build/./gcc/ -dumpspecs > tmp-specs
/bin/sh: line 1: 48503 Bus error               /Users/regress/tbox/native/build/./gcc/xgcc -B/Users/regress/tbox/native/build/./gcc/ -dumpspecs > tmp-specs
make[3]: *** [specs] Error 138
make[3]: *** Waiting for unfinished jobs....
rm gcov.pod cpp.pod gfdl.pod fsf-funding.pod gcc.pod
make[2]: *** [all-stage1-gcc] Error 2
make[1]: *** [stage1-bubble] Error 2
make: *** [bootstrap] Error 2
+ '[' -s .bad_compare ']'
+ exit 1
-------------- next part --------------

-- 
Geoffrey Keating <geoffk@apple.com> 
(via an automated GCC regression-testing script.)


More information about the Gcc-regression mailing list