GCC build failure, HEAD@164561 on native

regress regress@apple.com
Thu Sep 23 12:58:00 GMT 2010


With your recent patch, GCC HEAD revision 164561 had problems on:
native: build (about the same as the previous build)
Attached is build output for those targets.
The previous build was of revision 164558.

Log information for changes since the last build:
------------------------------------------------------------------------
r164561 | rguenth | 2010-09-23 05:39:26 -0700 (Thu, 23 Sep 2010) | 8 lines
Changed paths:
   M /trunk/gcc/ChangeLog
   M /trunk/gcc/cgraphunit.c
   M /trunk/gcc/testsuite/ChangeLog
   A /trunk/gcc/testsuite/g++.dg/ipa/pr45565.C

2010-09-23  Richard Guenther  <rguenther@suse.de>

	PR tree-optimization/45565
	* cgraphunit.c (cgraph_redirect_edge_call_stmt_to_callee):
	Make sure to adjust the fndecl before replacing the stmt.

	* g++.dg/ipa/pr45565.C: New testcase.

------------------------------------------------------------------------

For more information, see <http://gcc.gnu.org/regtest/HEAD/>.

-------------- next part --------------
gcc   -g -fkeep-inline-functions -DIN_GCC   -W -Wall -Wwrite-strings -Wcast-qual -Wstrict-prototypes -Wmissing-prototypes -Wmissing-format-attribute -pedantic -Wno-long-long -Wno-variadic-macros -Wno-overlength-strings -Wold-style-definition -Wc++-compat -fno-common  -DHAVE_CONFIG_H  gcov-dump.o version.o errors.o \
		../libcpp/libcpp.a ./../intl/libintl.a -liconv  ../libiberty/libiberty.a ../libdecnumber/libdecnumber.a  -o gcov-dump
gcc   -g -fkeep-inline-functions -DIN_GCC   -W -Wall -Wwrite-strings -Wcast-qual -Wstrict-prototypes -Wmissing-prototypes -Wmissing-format-attribute -pedantic -Wno-long-long -Wno-variadic-macros -Wno-overlength-strings -Wold-style-definition -Wc++-compat -fno-common  -DHAVE_CONFIG_H  -o Tcollect2 \
		collect2.o collect2-aix.o tlink.o intl.o version.o ../libcpp/libcpp.a ./../intl/libintl.a -liconv  ../libiberty/libiberty.a ../libdecnumber/libdecnumber.a  
mv -f Tcollect2 collect2
gcc   -g -fkeep-inline-functions -DIN_GCC   -W -Wall -Wwrite-strings -Wcast-qual -Wstrict-prototypes -Wmissing-prototypes -Wmissing-format-attribute -pedantic -Wno-long-long -Wno-variadic-macros -Wno-overlength-strings -Wold-style-definition -Wc++-compat -fno-common  -DHAVE_CONFIG_H  -o xgcc gcc.o opts-common.o gcc-options.o diagnostic.o pretty-print.o input.o \
	  gccspec.o intl.o prefix.o version.o driver-rs6000.o darwin-driver.o ../libcpp/libcpp.a ./../intl/libintl.a -liconv  ../libiberty/libiberty.a ../libdecnumber/libdecnumber.a 
gcc -c   -g -fkeep-inline-functions -DIN_GCC   -W -Wall -Wwrite-strings -Wcast-qual -Wstrict-prototypes -Wmissing-prototypes -Wmissing-format-attribute -pedantic -Wno-long-long -Wno-variadic-macros -Wno-overlength-strings -Wold-style-definition -Wc++-compat -fno-common  -DHAVE_CONFIG_H -I. -I. -I/Users/regress/tbox/svn-gcc/gcc -I/Users/regress/tbox/svn-gcc/gcc/. -I/Users/regress/tbox/svn-gcc/gcc/../include -I./../intl -I/Users/regress/tbox/svn-gcc/gcc/../libcpp/include  -I/Users/regress/tbox/svn-gcc/gcc/../libdecnumber -I/Users/regress/tbox/svn-gcc/gcc/../libdecnumber/dpd -I../libdecnumber     insn-automata.c -o insn-automata.o
gcc   -g -fkeep-inline-functions -DIN_GCC   -W -Wall -Wwrite-strings -Wcast-qual -Wstrict-prototypes -Wmissing-prototypes -Wmissing-format-attribute -pedantic -Wno-long-long -Wno-variadic-macros -Wno-overlength-strings -Wold-style-definition -Wc++-compat -fno-common  -DHAVE_CONFIG_H  -o cpp gcc.o opts-common.o gcc-options.o diagnostic.o pretty-print.o input.o \
	  cppspec.o intl.o prefix.o version.o driver-rs6000.o darwin-driver.o ../libcpp/libcpp.a ./../intl/libintl.a -liconv  ../libiberty/libiberty.a ../libdecnumber/libdecnumber.a 
/Users/regress/tbox/native/build/./gcc/xgcc -B/Users/regress/tbox/native/build/./gcc/ -dumpspecs > tmp-specs
/bin/sh: line 1: 43569 Bus error               /Users/regress/tbox/native/build/./gcc/xgcc -B/Users/regress/tbox/native/build/./gcc/ -dumpspecs > tmp-specs
make[3]: *** [specs] Error 138
make[3]: *** Waiting for unfinished jobs....
rm gcov.pod cpp.pod gfdl.pod fsf-funding.pod gcc.pod
make[2]: *** [all-stage1-gcc] Error 2
make[1]: *** [stage1-bubble] Error 2
make: *** [bootstrap] Error 2
+ '[' -s .bad_compare ']'
+ exit 1
-------------- next part --------------

-- 
Geoffrey Keating <geoffk@apple.com> 
(via an automated GCC regression-testing script.)


More information about the Gcc-regression mailing list