GCC build failure, HEAD@164491 on native

GCC regression tester regress@geoffk.org
Tue Sep 21 19:09:00 GMT 2010


With your recent patch, GCC HEAD revision 164491 had problems on:
native: build (about the same as the previous build)
Attached is build output for those targets.
The previous build was of revision 164489.

Log information for changes since the last build:
------------------------------------------------------------------------
r164491 | nicola | 2010-09-21 11:51:34 -0700 (Tue, 21 Sep 2010) | 26 lines
Changed paths:
   M /trunk/gcc/ChangeLog
   M /trunk/gcc/c-decl.c
   M /trunk/gcc/c-family/c-common.h
   M /trunk/gcc/c-family/stub-objc.c
   M /trunk/gcc/objc/ChangeLog
   M /trunk/gcc/objc/objc-act.c
   M /trunk/gcc/objcp/ChangeLog
   M /trunk/gcc/objcp/objcp-decl.c
   M /trunk/gcc/testsuite/ChangeLog
   A /trunk/gcc/testsuite/obj-c++.dg/naming-1.mm
   A /trunk/gcc/testsuite/obj-c++.dg/naming-2.mm
   A /trunk/gcc/testsuite/objc.dg/naming-4.m
   A /trunk/gcc/testsuite/objc.dg/naming-5.m

PR objc/25965
In gcc/objc/:
       * objc-act.c (objc_get_interface_ivars): New function.
       (objc_collecting_ivars): New variable.
       (continue_class): Set and reset objc_collecting_ivars for context.
In gcc/:
       * c-decl.c (detect_field_duplicates): If compiling Objective-C,
       call objc_get_interface_ivars ().
       * c-family/c-common.h (objc_get_interface_ivars): New declaration.
       * c-family/stub-objc.c (objc_get_interface_ivars): New stub.
In gcc/objcp/:
       * objcp-decl.c (objcp_finish_struct): Call
       objc_get_interface_ivars() and check for duplicate ivars.

In gcc/testsuite/:
       Merge from 'apple/trunk' branch on FSF servers.

       2005-10-11  Fariborz Jahanian <fjahanian@apple.com>

               Radar 4291785

               objc.dg/naming-4.m: New
               objc.dg/naming-5.m: New
               obj-c++.dg/naming-1.mm: New
               obj-c++.dg/naming-2.mm: New

------------------------------------------------------------------------

For more information, see <http://glutton.geoffk.org/HEAD/>.

-------------- next part --------------
/home/regress/tbox/native/build/./prev-gcc/xgcc -B/home/regress/tbox/native/build/./prev-gcc/ -B/home/regress/tbox/objs/i686-pc-linux-gnu/bin/ -B/home/regress/tbox/objs/i686-pc-linux-gnu/bin/ -B/home/regress/tbox/objs/i686-pc-linux-gnu/lib/ -isystem /home/regress/tbox/objs/i686-pc-linux-gnu/include -isystem /home/regress/tbox/objs/i686-pc-linux-gnu/sys-include    -c   -g -O2 -fomit-frame-pointer -gtoggle -DIN_GCC   -W -Wall -Wwrite-strings -Wcast-qual -Wstrict-prototypes -Wmissing-prototypes -Wmissing-format-attribute -pedantic -Wno-long-long -Wno-variadic-macros -Wno-overlength-strings -Werror -Wold-style-definition -Wc++-compat -fno-common  -DHAVE_CONFIG_H -I. -I. -I/home/regress/tbox/svn-gcc/gcc -I/home/regress/tbox/svn-gcc/gcc/. -I/home/regress/tbox/svn-gcc/gcc/../include -I/home/regress/tbox/svn-gcc/gcc/../libcpp/include  -I/home/regress/tbox/svn-gcc/gcc/../libdecnumber -I/home/regress/tbox/svn-gcc/gcc/../libdecnumber/bid -I../libdecnumber   -I/usr/include/libelf  -I. -!
 I. -I/home/regress/tbox/svn-gcc/gcc -I/home/regress/tbox/svn-gcc/gcc/. -I/home/regress/tbox/svn-gcc/gcc/../include -I/home/regress/tbox/svn-gcc/gcc/../libcpp/include  -I/home/regress/tbox/svn-gcc/gcc/../libdecnumber -I/home/regress/tbox/svn-gcc/gcc/../libdecnumber/bid -I../libdecnumber   -I/usr/include/libelf \
		/home/regress/tbox/svn-gcc/gcc/config/host-linux.c
/home/regress/tbox/native/build/./prev-gcc/xgcc -B/home/regress/tbox/native/build/./prev-gcc/ -B/home/regress/tbox/objs/i686-pc-linux-gnu/bin/ -B/home/regress/tbox/objs/i686-pc-linux-gnu/bin/ -B/home/regress/tbox/objs/i686-pc-linux-gnu/lib/ -isystem /home/regress/tbox/objs/i686-pc-linux-gnu/include -isystem /home/regress/tbox/objs/i686-pc-linux-gnu/sys-include    -c   -g -O2 -fomit-frame-pointer -gtoggle -DIN_GCC   -W -Wall -Wwrite-strings -Wcast-qual -Wstrict-prototypes -Wmissing-prototypes -Wmissing-format-attribute -pedantic -Wno-long-long -Wno-variadic-macros -Wno-overlength-strings -Werror -Wold-style-definition -Wc++-compat -fno-common  -DHAVE_CONFIG_H -I. -I. -I/home/regress/tbox/svn-gcc/gcc -I/home/regress/tbox/svn-gcc/gcc/. -I/home/regress/tbox/svn-gcc/gcc/../include -I/home/regress/tbox/svn-gcc/gcc/../libcpp/include  -I/home/regress/tbox/svn-gcc/gcc/../libdecnumber -I/home/regress/tbox/svn-gcc/gcc/../libdecnumber/bid -I../libdecnumber   -I/usr/include/libelf  /home!
 /regress/tbox/svn-gcc/gcc/cgraph.c -o cgraph.o
/home/regress/tbox/native/build/./prev-gcc/xgcc -B/home/regress/tbox/native/build/./prev-gcc/ -B/home/regress/tbox/objs/i686-pc-linux-gnu/bin/ -B/home/regress/tbox/objs/i686-pc-linux-gnu/bin/ -B/home/regress/tbox/objs/i686-pc-linux-gnu/lib/ -isystem /home/regress/tbox/objs/i686-pc-linux-gnu/include -isystem /home/regress/tbox/objs/i686-pc-linux-gnu/sys-include    -c   -g -O2 -fomit-frame-pointer -gtoggle -DIN_GCC   -W -Wall -Wwrite-strings -Wcast-qual -Wstrict-prototypes -Wmissing-prototypes -Wmissing-format-attribute -pedantic -Wno-long-long -Wno-variadic-macros -Wno-overlength-strings -Werror -Wold-style-definition -Wc++-compat -fno-common  -DHAVE_CONFIG_H -I. -I. -I/home/regress/tbox/svn-gcc/gcc -I/home/regress/tbox/svn-gcc/gcc/. -I/home/regress/tbox/svn-gcc/gcc/../include -I/home/regress/tbox/svn-gcc/gcc/../libcpp/include  -I/home/regress/tbox/svn-gcc/gcc/../libdecnumber -I/home/regress/tbox/svn-gcc/gcc/../libdecnumber/bid -I../libdecnumber   -I/usr/include/libelf  /home!
 /regress/tbox/svn-gcc/gcc/cgraphbuild.c -o cgraphbuild.o
/home/regress/tbox/svn-gcc/gcc/config/i386/i386.c: In function 'ix86_expand_prologue':
/home/regress/tbox/svn-gcc/gcc/config/i386/i386.c:9696:7: error: ISO C90 forbids mixed declarations and code [-Werror=edantic]
/home/regress/tbox/native/build/./prev-gcc/xgcc -B/home/regress/tbox/native/build/./prev-gcc/ -B/home/regress/tbox/objs/i686-pc-linux-gnu/bin/ -B/home/regress/tbox/objs/i686-pc-linux-gnu/bin/ -B/home/regress/tbox/objs/i686-pc-linux-gnu/lib/ -isystem /home/regress/tbox/objs/i686-pc-linux-gnu/include -isystem /home/regress/tbox/objs/i686-pc-linux-gnu/sys-include    -c   -g -O2 -fomit-frame-pointer -gtoggle -DIN_GCC   -W -Wall -Wwrite-strings -Wcast-qual -Wstrict-prototypes -Wmissing-prototypes -Wmissing-format-attribute -pedantic -Wno-long-long -Wno-variadic-macros -Wno-overlength-strings -Werror -Wold-style-definition -Wc++-compat -fno-common  -DHAVE_CONFIG_H -I. -I. -I/home/regress/tbox/svn-gcc/gcc -I/home/regress/tbox/svn-gcc/gcc/. -I/home/regress/tbox/svn-gcc/gcc/../include -I/home/regress/tbox/svn-gcc/gcc/../libcpp/include  -I/home/regress/tbox/svn-gcc/gcc/../libdecnumber -I/home/regress/tbox/svn-gcc/gcc/../libdecnumber/bid -I../libdecnumber   -I/usr/include/libelf  /home!
 /regress/tbox/svn-gcc/gcc/cgraphunit.c -o cgraphunit.o
cc1: all warnings being treated as errors

make[3]: *** [i386.o] Error 1
make[3]: *** Waiting for unfinished jobs....
rm gcj-dbtool.pod jcf-dump.pod jv-convert.pod grmic.pod gcov.pod gcj.pod gc-analyze.pod gfdl.pod cpp.pod gij.pod gfortran.pod fsf-funding.pod gcc.pod
make[3]: Leaving directory `/home/regress/tbox/native/build/gcc'
make[2]: *** [all-stage2-gcc] Error 2
make[2]: Leaving directory `/home/regress/tbox/native/build'
make[1]: *** [stage2-bubble] Error 2
make[1]: Leaving directory `/home/regress/tbox/native/build'
make: *** [bootstrap] Error 2
+ '[' -s .bad_compare ']'
+ exit 1
-------------- next part --------------

-- 
Geoffrey Keating <geoffk@geoffk.org> 
(via an automated GCC regression-testing script.)


More information about the Gcc-regression mailing list