GCC build failure, HEAD@164295 on native

regress regress@apple.com
Wed Sep 15 04:35:00 GMT 2010


With your recent patch, GCC HEAD revision 164295 had problems on:
native: build (about the same as the previous build)
Attached is build output for those targets.
The previous build was of revision 164294.

Log information for changes since the last build:
------------------------------------------------------------------------
r164295 | lauras | 2010-09-14 20:08:22 -0700 (Tue, 14 Sep 2010) | 14 lines
Changed paths:
   M /trunk/gcc/ChangeLog
   M /trunk/gcc/c-lang.h
   M /trunk/gcc/lto/ChangeLog
   M /trunk/gcc/lto/lto-tree.h


gcc/ChangeLog:

2010-09-14  Laurynas Biveinis  <laurynas.biveinis@gmail.com>

       * c-lang.h (struct lang_type): Add variable_size GTY option.

gcc/lto/ChangeLog:

2010-09-14  Laurynas Biveinis  <laurynas.biveinis@gmail.com>

       * lto-tree.h (struct lang_type): Add variable_size GTY option.


------------------------------------------------------------------------

For more information, see <http://gcc.gnu.org/regtest/HEAD/>.

-------------- next part --------------
	-DREVISION="\"\"" \
	-DDEVPHASE="\" (experimental)\"" -DPKGVERSION="\"(GCC) \"" \
	-DBUGURL="\"<http://gcc.gnu.org/bugs.html>\"" -c /Users/regress/tbox/svn-gcc/gcc/version.c -o version.o
/Users/regress/tbox/native/build/./prev-gcc/xgcc -B/Users/regress/tbox/native/build/./prev-gcc/ -B/Users/regress/tbox/objs/powerpc-apple-darwin9.8.0/bin/ -B/Users/regress/tbox/objs/powerpc-apple-darwin9.8.0/bin/ -B/Users/regress/tbox/objs/powerpc-apple-darwin9.8.0/lib/ -isystem /Users/regress/tbox/objs/powerpc-apple-darwin9.8.0/include -isystem /Users/regress/tbox/objs/powerpc-apple-darwin9.8.0/sys-include    -c   -g -O2 -mdynamic-no-pic -gtoggle -DIN_GCC   -W -Wall -Wwrite-strings -Wcast-qual -Wstrict-prototypes -Wmissing-prototypes -Wmissing-format-attribute -pedantic -Wno-long-long -Wno-variadic-macros -Wno-overlength-strings -Werror -Wold-style-definition -Wc++-compat -fno-common  -DHAVE_CONFIG_H -I. -I. -I/Users/regress/tbox/svn-gcc/gcc -I/Users/regress/tbox/svn-gcc/gcc/. -I/Users/regress/tbox/svn-gcc/gcc/../include -I./../intl -I/Users/regress/tbox/svn-gcc/gcc/../libcpp/include  -I/Users/regress/tbox/svn-gcc/gcc/../libdecnumber -I/Users/regress/tbox/svn-gcc/gcc/../libde
 cnumber/dpd -I../libdecnumber     /Users/regress/tbox/svn-gcc/gcc/vmsdbgout.c -o vmsdbgout.o
/Users/regress/tbox/native/build/./prev-gcc/xgcc -B/Users/regress/tbox/native/build/./prev-gcc/ -B/Users/regress/tbox/objs/powerpc-apple-darwin9.8.0/bin/ -B/Users/regress/tbox/objs/powerpc-apple-darwin9.8.0/bin/ -B/Users/regress/tbox/objs/powerpc-apple-darwin9.8.0/lib/ -isystem /Users/regress/tbox/objs/powerpc-apple-darwin9.8.0/include -isystem /Users/regress/tbox/objs/powerpc-apple-darwin9.8.0/sys-include    -c   -g -O2 -mdynamic-no-pic -gtoggle -DIN_GCC   -W -Wall -Wwrite-strings -Wcast-qual -Wstrict-prototypes -Wmissing-prototypes -Wmissing-format-attribute -pedantic -Wno-long-long -Wno-variadic-macros -Wno-overlength-strings -Werror -Wold-style-definition -Wc++-compat -fno-common  -DHAVE_CONFIG_H -I. -I. -I/Users/regress/tbox/svn-gcc/gcc -I/Users/regress/tbox/svn-gcc/gcc/. -I/Users/regress/tbox/svn-gcc/gcc/../include -I./../intl -I/Users/regress/tbox/svn-gcc/gcc/../libcpp/include  -I/Users/regress/tbox/svn-gcc/gcc/../libdecnumber -I/Users/regress/tbox/svn-gcc/gcc/../libde
 cnumber/dpd -I../libdecnumber     /Users/regress/tbox/svn-gcc/gcc/web.c -o web.o
/Users/regress/tbox/native/build/./prev-gcc/xgcc -B/Users/regress/tbox/native/build/./prev-gcc/ -B/Users/regress/tbox/objs/powerpc-apple-darwin9.8.0/bin/ -B/Users/regress/tbox/objs/powerpc-apple-darwin9.8.0/bin/ -B/Users/regress/tbox/objs/powerpc-apple-darwin9.8.0/lib/ -isystem /Users/regress/tbox/objs/powerpc-apple-darwin9.8.0/include -isystem /Users/regress/tbox/objs/powerpc-apple-darwin9.8.0/sys-include    -c   -g -O2 -mdynamic-no-pic -gtoggle -DIN_GCC   -W -Wall -Wwrite-strings -Wcast-qual -Wstrict-prototypes -Wmissing-prototypes -Wmissing-format-attribute -pedantic -Wno-long-long -Wno-variadic-macros -Wno-overlength-strings -Werror -Wold-style-definition -Wc++-compat -fno-common  -DHAVE_CONFIG_H -I. -I. -I/Users/regress/tbox/svn-gcc/gcc -I/Users/regress/tbox/svn-gcc/gcc/. -I/Users/regress/tbox/svn-gcc/gcc/../include -I./../intl -I/Users/regress/tbox/svn-gcc/gcc/../libcpp/include  -I/Users/regress/tbox/svn-gcc/gcc/../libdecnumber -I/Users/regress/tbox/svn-gcc/gcc/../libde
 cnumber/dpd -I../libdecnumber     /Users/regress/tbox/svn-gcc/gcc/xcoffout.c -o xcoffout.o
/Users/regress/tbox/native/build/./prev-gcc/xgcc -B/Users/regress/tbox/native/build/./prev-gcc/ -B/Users/regress/tbox/objs/powerpc-apple-darwin9.8.0/bin/ -B/Users/regress/tbox/objs/powerpc-apple-darwin9.8.0/bin/ -B/Users/regress/tbox/objs/powerpc-apple-darwin9.8.0/lib/ -isystem /Users/regress/tbox/objs/powerpc-apple-darwin9.8.0/include -isystem /Users/regress/tbox/objs/powerpc-apple-darwin9.8.0/sys-include    -c   -g -O2 -mdynamic-no-pic -gtoggle -DIN_GCC   -W -Wall -Wwrite-strings -Wcast-qual -Wstrict-prototypes -Wmissing-prototypes -Wmissing-format-attribute -pedantic -Wno-long-long -Wno-variadic-macros -Wno-overlength-strings -Werror -Wold-style-definition -Wc++-compat -fno-common  -DHAVE_CONFIG_H -I. -I. -I/Users/regress/tbox/svn-gcc/gcc -I/Users/regress/tbox/svn-gcc/gcc/. -I/Users/regress/tbox/svn-gcc/gcc/../include -I./../intl -I/Users/regress/tbox/svn-gcc/gcc/../libcpp/include  -I/Users/regress/tbox/svn-gcc/gcc/../libdecnumber -I/Users/regress/tbox/svn-gcc/gcc/../libde
 cnumber/dpd -I../libdecnumber     \
		/Users/regress/tbox/svn-gcc/gcc/config/rs6000/rs6000.c -o rs6000.o
/Users/regress/tbox/svn-gcc/gcc/config/rs6000/rs6000.c:1666:8: error: initialization from incompatible pointer type [-Werror]
/Users/regress/tbox/svn-gcc/gcc/config/rs6000/rs6000.c:1666:8: error: (near initialization for 'targetm.vectorize.units_per_simd_word') [-Werror]
cc1: all warnings being treated as errors

make[3]: *** [rs6000.o] Error 1
make[3]: *** Waiting for unfinished jobs....
rm gcj-dbtool.pod gcov.pod jcf-dump.pod jv-convert.pod gcj.pod gc-analyze.pod cpp.pod gfdl.pod gij.pod gfortran.pod fsf-funding.pod gcc.pod grmic.pod
make[2]: *** [all-stage2-gcc] Error 2
make[1]: *** [stage2-bubble] Error 2
make: *** [bootstrap] Error 2
+ '[' -s .bad_compare ']'
+ exit 1
-------------- next part --------------

-- 
Geoffrey Keating <geoffk@apple.com> 
(via an automated GCC regression-testing script.)


More information about the Gcc-regression mailing list