GCC build failure, HEAD@164290 on native

regress regress@apple.com
Wed Sep 15 01:34:00 GMT 2010


With your recent patch, GCC HEAD revision 164290 had problems on:
native: build (about the same as the previous build)
Attached is build output for those targets.
The previous build was of revision 164289.

Log information for changes since the last build:
------------------------------------------------------------------------
r164290 | nicola | 2010-09-14 17:08:59 -0700 (Tue, 14 Sep 2010) | 62 lines
Changed paths:
   M /trunk/gcc/objc/ChangeLog
   M /trunk/gcc/objc/objc-act.c
   M /trunk/gcc/testsuite/ChangeLog
   A /trunk/gcc/testsuite/obj-c++.dg/comp-types-13.mm
   A /trunk/gcc/testsuite/obj-c++.dg/msg-in-protocol.mm
   A /trunk/gcc/testsuite/obj-c++.dg/proto-lossage-7.mm
   A /trunk/gcc/testsuite/objc.dg/break-in-ifstmt.m
   A /trunk/gcc/testsuite/objc.dg/comp-types-12.m
   A /trunk/gcc/testsuite/objc.dg/msg-in-protocol.m
   A /trunk/gcc/testsuite/objc.dg/proto-lossage-7.m

In gcc/testsuite/:

2010-09-15  Nicola Pero  <nicola.pero@meta-innovation.com>

        Merge from 'apple/trunk' branch on FSF servers.

        2006-03-09 Fariborz Jahanian <fjahanian@apple.com>

        Radar 4457381
        * objc.dg/msg-in-protocol.m: New.
        * obj-c++.dg/msg-in-protocol.mm: New.

        2006-02-07  Fariborz Jahanian <fjahanian@apple.com>

        Radar 4219590
        * objc.dg/break-in-ifstmt.m: New.
        
        2005-08-22  Ziemowit Laski  <zlaski@apple.com>

        Radar 4174166
        * obj-c++.dg/comp-types-13.mm: New.
        * objc.dg/comp-types-12.m: New.

        2005-08-22  Ziemowit Laski  <zlaski@apple.com>

        Radar 4216500
        * obj-c++.dg/proto-lossage-7.mm: New.
        * objc.dg/proto-lossage-7.m: New.

In gcc/objc/:
        
2010-09-15  Nicola Pero  <nicola.pero@meta-innovation.com>

        Merge from 'apple/trunk' branch on FSF servers.

        2006-03-09 Fariborz Jahanian <fjahanian@apple.com>

        Radar 4457381
        * objc/objc-act.c (objc_finish_message_expr): Look for message in
        @class's protocol list.

        2006-02-07  Fariborz Jahanian <fjahanian@apple.com>

        Radar 4219590
        * objc/objc-act.c (objc_start_method_definition): Initialize
        break/continue labels.

        2005-08-22  Ziemowit Laski  <zlaski@apple.com>

        Radar 4174166
        * objc-act.c (objc_compare_types): Compare function
        pointers; indicate success if the right-hand side has
        a return type that is covariant, and the argument types
        contravariant, with those of the left side.

        2005-08-22  Ziemowit Laski  <zlaski@apple.com>

        Radar 4216500
        * objc-act.c (objc_get_protocol_qualified_type): When looking
        at a typedef, retrieve the precise type it describes (rather
        than merely looking up a class by name).

------------------------------------------------------------------------

For more information, see <http://gcc.gnu.org/regtest/HEAD/>.

-------------- next part --------------
	-DREVISION="\"\"" \
	-DDEVPHASE="\" (experimental)\"" -DPKGVERSION="\"(GCC) \"" \
	-DBUGURL="\"<http://gcc.gnu.org/bugs.html>\"" -c /Users/regress/tbox/svn-gcc/gcc/version.c -o version.o
/Users/regress/tbox/native/build/./prev-gcc/xgcc -B/Users/regress/tbox/native/build/./prev-gcc/ -B/Users/regress/tbox/objs/powerpc-apple-darwin9.8.0/bin/ -B/Users/regress/tbox/objs/powerpc-apple-darwin9.8.0/bin/ -B/Users/regress/tbox/objs/powerpc-apple-darwin9.8.0/lib/ -isystem /Users/regress/tbox/objs/powerpc-apple-darwin9.8.0/include -isystem /Users/regress/tbox/objs/powerpc-apple-darwin9.8.0/sys-include    -c   -g -O2 -mdynamic-no-pic -gtoggle -DIN_GCC   -W -Wall -Wwrite-strings -Wcast-qual -Wstrict-prototypes -Wmissing-prototypes -Wmissing-format-attribute -pedantic -Wno-long-long -Wno-variadic-macros -Wno-overlength-strings -Werror -Wold-style-definition -Wc++-compat -fno-common  -DHAVE_CONFIG_H -I. -I. -I/Users/regress/tbox/svn-gcc/gcc -I/Users/regress/tbox/svn-gcc/gcc/. -I/Users/regress/tbox/svn-gcc/gcc/../include -I./../intl -I/Users/regress/tbox/svn-gcc/gcc/../libcpp/include  -I/Users/regress/tbox/svn-gcc/gcc/../libdecnumber -I/Users/regress/tbox/svn-gcc/gcc/../libde
 cnumber/dpd -I../libdecnumber     /Users/regress/tbox/svn-gcc/gcc/vmsdbgout.c -o vmsdbgout.o
/Users/regress/tbox/native/build/./prev-gcc/xgcc -B/Users/regress/tbox/native/build/./prev-gcc/ -B/Users/regress/tbox/objs/powerpc-apple-darwin9.8.0/bin/ -B/Users/regress/tbox/objs/powerpc-apple-darwin9.8.0/bin/ -B/Users/regress/tbox/objs/powerpc-apple-darwin9.8.0/lib/ -isystem /Users/regress/tbox/objs/powerpc-apple-darwin9.8.0/include -isystem /Users/regress/tbox/objs/powerpc-apple-darwin9.8.0/sys-include    -c   -g -O2 -mdynamic-no-pic -gtoggle -DIN_GCC   -W -Wall -Wwrite-strings -Wcast-qual -Wstrict-prototypes -Wmissing-prototypes -Wmissing-format-attribute -pedantic -Wno-long-long -Wno-variadic-macros -Wno-overlength-strings -Werror -Wold-style-definition -Wc++-compat -fno-common  -DHAVE_CONFIG_H -I. -I. -I/Users/regress/tbox/svn-gcc/gcc -I/Users/regress/tbox/svn-gcc/gcc/. -I/Users/regress/tbox/svn-gcc/gcc/../include -I./../intl -I/Users/regress/tbox/svn-gcc/gcc/../libcpp/include  -I/Users/regress/tbox/svn-gcc/gcc/../libdecnumber -I/Users/regress/tbox/svn-gcc/gcc/../libde
 cnumber/dpd -I../libdecnumber     /Users/regress/tbox/svn-gcc/gcc/web.c -o web.o
/Users/regress/tbox/native/build/./prev-gcc/xgcc -B/Users/regress/tbox/native/build/./prev-gcc/ -B/Users/regress/tbox/objs/powerpc-apple-darwin9.8.0/bin/ -B/Users/regress/tbox/objs/powerpc-apple-darwin9.8.0/bin/ -B/Users/regress/tbox/objs/powerpc-apple-darwin9.8.0/lib/ -isystem /Users/regress/tbox/objs/powerpc-apple-darwin9.8.0/include -isystem /Users/regress/tbox/objs/powerpc-apple-darwin9.8.0/sys-include    -c   -g -O2 -mdynamic-no-pic -gtoggle -DIN_GCC   -W -Wall -Wwrite-strings -Wcast-qual -Wstrict-prototypes -Wmissing-prototypes -Wmissing-format-attribute -pedantic -Wno-long-long -Wno-variadic-macros -Wno-overlength-strings -Werror -Wold-style-definition -Wc++-compat -fno-common  -DHAVE_CONFIG_H -I. -I. -I/Users/regress/tbox/svn-gcc/gcc -I/Users/regress/tbox/svn-gcc/gcc/. -I/Users/regress/tbox/svn-gcc/gcc/../include -I./../intl -I/Users/regress/tbox/svn-gcc/gcc/../libcpp/include  -I/Users/regress/tbox/svn-gcc/gcc/../libdecnumber -I/Users/regress/tbox/svn-gcc/gcc/../libde
 cnumber/dpd -I../libdecnumber     /Users/regress/tbox/svn-gcc/gcc/xcoffout.c -o xcoffout.o
/Users/regress/tbox/native/build/./prev-gcc/xgcc -B/Users/regress/tbox/native/build/./prev-gcc/ -B/Users/regress/tbox/objs/powerpc-apple-darwin9.8.0/bin/ -B/Users/regress/tbox/objs/powerpc-apple-darwin9.8.0/bin/ -B/Users/regress/tbox/objs/powerpc-apple-darwin9.8.0/lib/ -isystem /Users/regress/tbox/objs/powerpc-apple-darwin9.8.0/include -isystem /Users/regress/tbox/objs/powerpc-apple-darwin9.8.0/sys-include    -c   -g -O2 -mdynamic-no-pic -gtoggle -DIN_GCC   -W -Wall -Wwrite-strings -Wcast-qual -Wstrict-prototypes -Wmissing-prototypes -Wmissing-format-attribute -pedantic -Wno-long-long -Wno-variadic-macros -Wno-overlength-strings -Werror -Wold-style-definition -Wc++-compat -fno-common  -DHAVE_CONFIG_H -I. -I. -I/Users/regress/tbox/svn-gcc/gcc -I/Users/regress/tbox/svn-gcc/gcc/. -I/Users/regress/tbox/svn-gcc/gcc/../include -I./../intl -I/Users/regress/tbox/svn-gcc/gcc/../libcpp/include  -I/Users/regress/tbox/svn-gcc/gcc/../libdecnumber -I/Users/regress/tbox/svn-gcc/gcc/../libde
 cnumber/dpd -I../libdecnumber     \
		/Users/regress/tbox/svn-gcc/gcc/config/rs6000/rs6000.c -o rs6000.o
/Users/regress/tbox/svn-gcc/gcc/config/rs6000/rs6000.c:1666:8: error: initialization from incompatible pointer type [-Werror]
/Users/regress/tbox/svn-gcc/gcc/config/rs6000/rs6000.c:1666:8: error: (near initialization for 'targetm.vectorize.units_per_simd_word') [-Werror]
cc1: all warnings being treated as errors

make[3]: *** [rs6000.o] Error 1
make[3]: *** Waiting for unfinished jobs....
rm gcj-dbtool.pod gcov.pod jcf-dump.pod jv-convert.pod gcj.pod gc-analyze.pod cpp.pod gfdl.pod gij.pod gfortran.pod fsf-funding.pod gcc.pod grmic.pod
make[2]: *** [all-stage2-gcc] Error 2
make[1]: *** [stage2-bubble] Error 2
make: *** [bootstrap] Error 2
+ '[' -s .bad_compare ']'
+ exit 1
-------------- next part --------------

-- 
Geoffrey Keating <geoffk@apple.com> 
(via an automated GCC regression-testing script.)


More information about the Gcc-regression mailing list