GCC build failure, HEAD@164278 on native

GCC regression tester regress@geoffk.org
Tue Sep 14 10:37:00 GMT 2010


With your recent patch, GCC HEAD revision 164278 had problems on:
native: build (about the same as the previous build)
Attached is build output for those targets.
The previous build was of revision 164275.

Log information for changes since the last build:
------------------------------------------------------------------------
r164276 | nicola | 2010-09-14 03:23:37 -0700 (Tue, 14 Sep 2010) | 14 lines
Changed paths:
   M /trunk/libobjc/ChangeLog
   M /trunk/libobjc/Makefile.in
   M /trunk/libobjc/acinclude.m4
   M /trunk/libobjc/config.h.in
   M /trunk/libobjc/configure
   M /trunk/libobjc/configure.ac
   M /trunk/libobjc/init.c
   A /trunk/libobjc/objc/objc-sync.h
   A /trunk/libobjc/objc-private/objc-sync.h
   A /trunk/libobjc/objc-sync.c

In libobjc/:
       Implemented objc_sync_enter() and objc_sync_exit(), which are
       required by @synchronized() to work.
       * objc-sync.c: New file.
       * objc/objc-sync.h: New file.
       * objc-private/objc-sync.h: New file.
       * init.c (__objc_exec_class): Call __objc_sync_init() during the
       Objective-C runtime startup.
       * Makefile.in: Added objc-sync.c and objc-sync.h.
       * configure.ac: Added GCC_CHECK_TLS.
       * acinclude.m4: Include ../config/enable.m4 and ../config/tls.m4.
       * configure: Regenerated.
       * config.h.in: Regenerated.

------------------------------------------------------------------------
r164277 | ebotcazou | 2010-09-14 03:26:40 -0700 (Tue, 14 Sep 2010) | 6 lines
Changed paths:
   M /trunk/gcc/ChangeLog
   M /trunk/gcc/doc/install.texi

	PR target/45277
	PR target/45363
	PR target/45407
	* doc/install.texi (sparc*-*-*): New section.
	(sparc-sun-solaris2*): Mention MPC alongside GMP and MPFR.

------------------------------------------------------------------------
r164278 | paolo | 2010-09-14 03:27:36 -0700 (Tue, 14 Sep 2010) | 20 lines
Changed paths:
   M /trunk/libstdc++-v3/ChangeLog
   A /trunk/libstdc++-v3/testsuite/performance/21_strings/append-1.cc (from /trunk/libstdc++-v3/testsuite/performance/21_strings/string_append.cc:164270)
   A /trunk/libstdc++-v3/testsuite/performance/21_strings/append-2.cc (from /trunk/libstdc++-v3/testsuite/performance/21_strings/string_append_2.cc:164270)
   A /trunk/libstdc++-v3/testsuite/performance/21_strings/cons_input_iterator.cc (from /trunk/libstdc++-v3/testsuite/performance/21_strings/string_cons_input_iterator.cc:164270)
   A /trunk/libstdc++-v3/testsuite/performance/21_strings/copy_cons_and_dest.cc (from /trunk/libstdc++-v3/testsuite/performance/21_strings/string_copy_cons_and_dest.cc:164270)
   A /trunk/libstdc++-v3/testsuite/performance/21_strings/find.cc (from /trunk/libstdc++-v3/testsuite/performance/21_strings/string_find.cc:164270)
   A /trunk/libstdc++-v3/testsuite/performance/21_strings/hash.cc
   D /trunk/libstdc++-v3/testsuite/performance/21_strings/string_append.cc
   D /trunk/libstdc++-v3/testsuite/performance/21_strings/string_append_2.cc
   D /trunk/libstdc++-v3/testsuite/performance/21_strings/string_cons_input_iterator.cc
   D /trunk/libstdc++-v3/testsuite/performance/21_strings/string_copy_cons_and_dest.cc
   D /trunk/libstdc++-v3/testsuite/performance/21_strings/string_find.cc

2010-09-14  Matt Austern  <austern@google.com>
	    Paolo Carlini  <paolo.carlini@oracle.com>

	* testsuite/performance/21_strings/hash.cc: New.

2010-09-14  Paolo Carlini  <paolo.carlini@oracle.com>

	* testsuite/performance/21_strings/string_append.cc: Rename to...
	* testsuite/performance/21_strings/append-1.cc: ... this.
	* testsuite/performance/21_strings/string_append_2.cc: Rename to...
	* testsuite/performance/21_strings/append-2.cc: ... this.
	* testsuite/performance/21_strings/string_cons_input_iterator.cc:
	Rename to...
	* testsuite/performance/21_strings/cons_input_iterator.cc: ... this.
	* testsuite/performance/21_strings/string_copy_cons_and_dest.cc:
	Rename to...
	* testsuite/performance/21_strings/copy_cons_and_dest.cc: ... this.
	* testsuite/performance/21_strings/string_find.cc: Rename to...
	* testsuite/performance/21_strings/find.cc: ... this.

------------------------------------------------------------------------

For more information, see <http://glutton.geoffk.org/HEAD/>.

-------------- next part --------------
/home/regress/tbox/native/build/./prev-gcc/xgcc -B/home/regress/tbox/native/build/./prev-gcc/ -B/home/regress/tbox/objs/i686-pc-linux-gnu/bin/ -B/home/regress/tbox/objs/i686-pc-linux-gnu/bin/ -B/home/regress/tbox/objs/i686-pc-linux-gnu/lib/ -isystem /home/regress/tbox/objs/i686-pc-linux-gnu/include -isystem /home/regress/tbox/objs/i686-pc-linux-gnu/sys-include    -c   -g -O2 -fomit-frame-pointer -gtoggle -DIN_GCC   -W -Wall -Wwrite-strings -Wcast-qual -Wstrict-prototypes -Wmissing-prototypes -Wmissing-format-attribute -pedantic -Wno-long-long -Wno-variadic-macros -Wno-overlength-strings -Werror -Wold-style-definition -Wc++-compat -fno-common  -DHAVE_CONFIG_H -I. -I. -I/home/regress/tbox/svn-gcc/gcc -I/home/regress/tbox/svn-gcc/gcc/. -I/home/regress/tbox/svn-gcc/gcc/../include -I/home/regress/tbox/svn-gcc/gcc/../libcpp/include  -I/home/regress/tbox/svn-gcc/gcc/../libdecnumber -I/home/regress/tbox/svn-gcc/gcc/../libdecnumber/bid -I../libdecnumber   -I/usr/include/libelf  /home!
 /regress/tbox/svn-gcc/gcc/tree-vect-data-refs.c -o tree-vect-data-refs.o
/home/regress/tbox/native/build/./prev-gcc/xgcc -B/home/regress/tbox/native/build/./prev-gcc/ -B/home/regress/tbox/objs/i686-pc-linux-gnu/bin/ -B/home/regress/tbox/objs/i686-pc-linux-gnu/bin/ -B/home/regress/tbox/objs/i686-pc-linux-gnu/lib/ -isystem /home/regress/tbox/objs/i686-pc-linux-gnu/include -isystem /home/regress/tbox/objs/i686-pc-linux-gnu/sys-include    -c   -g -O2 -fomit-frame-pointer -gtoggle -DIN_GCC   -W -Wall -Wwrite-strings -Wcast-qual -Wstrict-prototypes -Wmissing-prototypes -Wmissing-format-attribute -pedantic -Wno-long-long -Wno-variadic-macros -Wno-overlength-strings -Werror -Wold-style-definition -Wc++-compat -fno-common  -DHAVE_CONFIG_H -I. -I. -I/home/regress/tbox/svn-gcc/gcc -I/home/regress/tbox/svn-gcc/gcc/. -I/home/regress/tbox/svn-gcc/gcc/../include -I/home/regress/tbox/svn-gcc/gcc/../libcpp/include  -I/home/regress/tbox/svn-gcc/gcc/../libdecnumber -I/home/regress/tbox/svn-gcc/gcc/../libdecnumber/bid -I../libdecnumber   -I/usr/include/libelf  /home!
 /regress/tbox/svn-gcc/gcc/tree-vect-stmts.c -o tree-vect-stmts.o
/home/regress/tbox/native/build/./prev-gcc/xgcc -B/home/regress/tbox/native/build/./prev-gcc/ -B/home/regress/tbox/objs/i686-pc-linux-gnu/bin/ -B/home/regress/tbox/objs/i686-pc-linux-gnu/bin/ -B/home/regress/tbox/objs/i686-pc-linux-gnu/lib/ -isystem /home/regress/tbox/objs/i686-pc-linux-gnu/include -isystem /home/regress/tbox/objs/i686-pc-linux-gnu/sys-include    -c   -g -O2 -fomit-frame-pointer -gtoggle -DIN_GCC   -W -Wall -Wwrite-strings -Wcast-qual -Wstrict-prototypes -Wmissing-prototypes -Wmissing-format-attribute -pedantic -Wno-long-long -Wno-variadic-macros -Wno-overlength-strings -Werror -Wold-style-definition -Wc++-compat -fno-common  -DHAVE_CONFIG_H -I. -I. -I/home/regress/tbox/svn-gcc/gcc -I/home/regress/tbox/svn-gcc/gcc/. -I/home/regress/tbox/svn-gcc/gcc/../include -I/home/regress/tbox/svn-gcc/gcc/../libcpp/include  -I/home/regress/tbox/svn-gcc/gcc/../libdecnumber -I/home/regress/tbox/svn-gcc/gcc/../libdecnumber/bid -I../libdecnumber   -I/usr/include/libelf  /home!
 /regress/tbox/svn-gcc/gcc/tree-vect-loop.c -o tree-vect-loop.o
/home/regress/tbox/native/build/./prev-gcc/xgcc -B/home/regress/tbox/native/build/./prev-gcc/ -B/home/regress/tbox/objs/i686-pc-linux-gnu/bin/ -B/home/regress/tbox/objs/i686-pc-linux-gnu/bin/ -B/home/regress/tbox/objs/i686-pc-linux-gnu/lib/ -isystem /home/regress/tbox/objs/i686-pc-linux-gnu/include -isystem /home/regress/tbox/objs/i686-pc-linux-gnu/sys-include    -c   -g -O2 -fomit-frame-pointer -gtoggle -DIN_GCC   -W -Wall -Wwrite-strings -Wcast-qual -Wstrict-prototypes -Wmissing-prototypes -Wmissing-format-attribute -pedantic -Wno-long-long -Wno-variadic-macros -Wno-overlength-strings -Werror -Wold-style-definition -Wc++-compat -fno-common  -DHAVE_CONFIG_H -I. -I. -I/home/regress/tbox/svn-gcc/gcc -I/home/regress/tbox/svn-gcc/gcc/. -I/home/regress/tbox/svn-gcc/gcc/../include -I/home/regress/tbox/svn-gcc/gcc/../libcpp/include  -I/home/regress/tbox/svn-gcc/gcc/../libdecnumber -I/home/regress/tbox/svn-gcc/gcc/../libdecnumber/bid -I../libdecnumber   -I/usr/include/libelf  /home!
 /regress/tbox/svn-gcc/gcc/tree-vect-loop-manip.c -o tree-vect-loop-manip.o
/home/regress/tbox/svn-gcc/gcc/tree-vect-stmts.c: In function 'get_vectype_for_scalar_type':
/home/regress/tbox/svn-gcc/gcc/tree-vect-stmts.c:4681:3: error: implicit declaration of function 'ix86_units_per_simd_word' [-Werror=implicit-function-declaration]
/home/regress/tbox/svn-gcc/gcc/tree-vect-stmts.c:4681:29: error: comparison between signed and unsigned integer expressions [-Werror=sign-compare]
cc1: all warnings being treated as errors

make[3]: *** [tree-vect-stmts.o] Error 1
make[3]: *** Waiting for unfinished jobs....
rm gcj-dbtool.pod jcf-dump.pod jv-convert.pod grmic.pod gcov.pod gcj.pod gc-analyze.pod gfdl.pod cpp.pod gij.pod gfortran.pod fsf-funding.pod gcc.pod
make[3]: Leaving directory `/home/regress/tbox/native/build/gcc'
make[2]: *** [all-stage2-gcc] Error 2
make[2]: Leaving directory `/home/regress/tbox/native/build'
make[1]: *** [stage2-bubble] Error 2
make[1]: Leaving directory `/home/regress/tbox/native/build'
make: *** [bootstrap] Error 2
+ '[' -s .bad_compare ']'
+ exit 1
-------------- next part --------------

-- 
Geoffrey Keating <geoffk@geoffk.org> 
(via an automated GCC regression-testing script.)


More information about the Gcc-regression mailing list