GCC build failure, HEAD@164258 on native

GCC regression tester regress@geoffk.org
Mon Sep 13 21:18:00 GMT 2010


With your recent patch, GCC HEAD revision 164258 had problems on:
native: build (about the same as the previous build)
Attached is build output for those targets.
The previous build was of revision 164256.

Log information for changes since the last build:
------------------------------------------------------------------------
r164257 | jakub | 2010-09-13 14:00:03 -0700 (Mon, 13 Sep 2010) | 6 lines
Changed paths:
   M /trunk/gcc/ChangeLog
   M /trunk/gcc/combine.c
   M /trunk/gcc/testsuite/ChangeLog
   A /trunk/gcc/testsuite/gcc.target/i386/pr45617.c

	PR rtl-optimization/45617
	* combine.c (simplify_comparison): Optimize (X >> N) {>,>=,<,<=} C
	even if low N bits of X aren't known to be zero.

	* gcc.target/i386/pr45617.c: New test.

------------------------------------------------------------------------
r164258 | ebotcazou | 2010-09-13 14:08:13 -0700 (Mon, 13 Sep 2010) | 4 lines
Changed paths:
   M /trunk/gcc/ChangeLog
   M /trunk/gcc/varasm.c

	PR debug/43937
	* varasm.c (output_constant_def_contents): Set TREE_ASM_WRITTEN on
	the DECL as well.

------------------------------------------------------------------------

For more information, see <http://glutton.geoffk.org/HEAD/>.

-------------- next part --------------
/home/regress/tbox/native/build/./prev-gcc/xgcc -B/home/regress/tbox/native/build/./prev-gcc/ -B/home/regress/tbox/objs/i686-pc-linux-gnu/bin/ -B/home/regress/tbox/objs/i686-pc-linux-gnu/bin/ -B/home/regress/tbox/objs/i686-pc-linux-gnu/lib/ -isystem /home/regress/tbox/objs/i686-pc-linux-gnu/include -isystem /home/regress/tbox/objs/i686-pc-linux-gnu/sys-include    -c   -g -O2 -fomit-frame-pointer -gtoggle -DIN_GCC   -W -Wall -Wwrite-strings -Wcast-qual -Wstrict-prototypes -Wmissing-prototypes -Wmissing-format-attribute -pedantic -Wno-long-long -Wno-variadic-macros -Wno-overlength-strings -Werror -Wold-style-definition -Wc++-compat -fno-common  -DHAVE_CONFIG_H -I. -I. -I/home/regress/tbox/svn-gcc/gcc -I/home/regress/tbox/svn-gcc/gcc/. -I/home/regress/tbox/svn-gcc/gcc/../include -I/home/regress/tbox/svn-gcc/gcc/../libcpp/include  -I/home/regress/tbox/svn-gcc/gcc/../libdecnumber -I/home/regress/tbox/svn-gcc/gcc/../libdecnumber/bid -I../libdecnumber   -I/usr/include/libelf  /home!
 /regress/tbox/svn-gcc/gcc/tree-vect-patterns.c -o tree-vect-patterns.o
/home/regress/tbox/native/build/./prev-gcc/xgcc -B/home/regress/tbox/native/build/./prev-gcc/ -B/home/regress/tbox/objs/i686-pc-linux-gnu/bin/ -B/home/regress/tbox/objs/i686-pc-linux-gnu/bin/ -B/home/regress/tbox/objs/i686-pc-linux-gnu/lib/ -isystem /home/regress/tbox/objs/i686-pc-linux-gnu/include -isystem /home/regress/tbox/objs/i686-pc-linux-gnu/sys-include    -c   -g -O2 -fomit-frame-pointer -gtoggle -DIN_GCC   -W -Wall -Wwrite-strings -Wcast-qual -Wstrict-prototypes -Wmissing-prototypes -Wmissing-format-attribute -pedantic -Wno-long-long -Wno-variadic-macros -Wno-overlength-strings -Werror -Wold-style-definition -Wc++-compat -fno-common  -DHAVE_CONFIG_H -I. -I. -I/home/regress/tbox/svn-gcc/gcc -I/home/regress/tbox/svn-gcc/gcc/. -I/home/regress/tbox/svn-gcc/gcc/../include -I/home/regress/tbox/svn-gcc/gcc/../libcpp/include  -I/home/regress/tbox/svn-gcc/gcc/../libdecnumber -I/home/regress/tbox/svn-gcc/gcc/../libdecnumber/bid -I../libdecnumber   -I/usr/include/libelf  /home!
 /regress/tbox/svn-gcc/gcc/tree-vect-data-refs.c -o tree-vect-data-refs.o
/home/regress/tbox/native/build/./prev-gcc/xgcc -B/home/regress/tbox/native/build/./prev-gcc/ -B/home/regress/tbox/objs/i686-pc-linux-gnu/bin/ -B/home/regress/tbox/objs/i686-pc-linux-gnu/bin/ -B/home/regress/tbox/objs/i686-pc-linux-gnu/lib/ -isystem /home/regress/tbox/objs/i686-pc-linux-gnu/include -isystem /home/regress/tbox/objs/i686-pc-linux-gnu/sys-include    -c   -g -O2 -fomit-frame-pointer -gtoggle -DIN_GCC   -W -Wall -Wwrite-strings -Wcast-qual -Wstrict-prototypes -Wmissing-prototypes -Wmissing-format-attribute -pedantic -Wno-long-long -Wno-variadic-macros -Wno-overlength-strings -Werror -Wold-style-definition -Wc++-compat -fno-common  -DHAVE_CONFIG_H -I. -I. -I/home/regress/tbox/svn-gcc/gcc -I/home/regress/tbox/svn-gcc/gcc/. -I/home/regress/tbox/svn-gcc/gcc/../include -I/home/regress/tbox/svn-gcc/gcc/../libcpp/include  -I/home/regress/tbox/svn-gcc/gcc/../libdecnumber -I/home/regress/tbox/svn-gcc/gcc/../libdecnumber/bid -I../libdecnumber   -I/usr/include/libelf  /home!
 /regress/tbox/svn-gcc/gcc/tree-vect-stmts.c -o tree-vect-stmts.o
/home/regress/tbox/native/build/./prev-gcc/xgcc -B/home/regress/tbox/native/build/./prev-gcc/ -B/home/regress/tbox/objs/i686-pc-linux-gnu/bin/ -B/home/regress/tbox/objs/i686-pc-linux-gnu/bin/ -B/home/regress/tbox/objs/i686-pc-linux-gnu/lib/ -isystem /home/regress/tbox/objs/i686-pc-linux-gnu/include -isystem /home/regress/tbox/objs/i686-pc-linux-gnu/sys-include    -c   -g -O2 -fomit-frame-pointer -gtoggle -DIN_GCC   -W -Wall -Wwrite-strings -Wcast-qual -Wstrict-prototypes -Wmissing-prototypes -Wmissing-format-attribute -pedantic -Wno-long-long -Wno-variadic-macros -Wno-overlength-strings -Werror -Wold-style-definition -Wc++-compat -fno-common  -DHAVE_CONFIG_H -I. -I. -I/home/regress/tbox/svn-gcc/gcc -I/home/regress/tbox/svn-gcc/gcc/. -I/home/regress/tbox/svn-gcc/gcc/../include -I/home/regress/tbox/svn-gcc/gcc/../libcpp/include  -I/home/regress/tbox/svn-gcc/gcc/../libdecnumber -I/home/regress/tbox/svn-gcc/gcc/../libdecnumber/bid -I../libdecnumber   -I/usr/include/libelf  /home!
 /regress/tbox/svn-gcc/gcc/tree-vect-loop.c -o tree-vect-loop.o
/home/regress/tbox/svn-gcc/gcc/tree-vect-stmts.c: In function 'get_vectype_for_scalar_type':
/home/regress/tbox/svn-gcc/gcc/tree-vect-stmts.c:4678:3: error: implicit declaration of function 'ix86_units_per_simd_word' [-Werror=implicit-function-declaration]
/home/regress/tbox/svn-gcc/gcc/tree-vect-stmts.c:4678:29: error: comparison between signed and unsigned integer expressions [-Werror=sign-compare]
cc1: all warnings being treated as errors

make[3]: *** [tree-vect-stmts.o] Error 1
make[3]: *** Waiting for unfinished jobs....
rm gcj-dbtool.pod jcf-dump.pod jv-convert.pod grmic.pod gcov.pod gcj.pod gc-analyze.pod gfdl.pod cpp.pod gij.pod gfortran.pod fsf-funding.pod gcc.pod
make[3]: Leaving directory `/home/regress/tbox/native/build/gcc'
make[2]: *** [all-stage2-gcc] Error 2
make[2]: Leaving directory `/home/regress/tbox/native/build'
make[1]: *** [stage2-bubble] Error 2
make[1]: Leaving directory `/home/regress/tbox/native/build'
make: *** [bootstrap] Error 2
+ '[' -s .bad_compare ']'
+ exit 1
-------------- next part --------------

-- 
Geoffrey Keating <geoffk@geoffk.org> 
(via an automated GCC regression-testing script.)


More information about the Gcc-regression mailing list