GCC build failure, HEAD@163907 on native

GCC regression tester regress@geoffk.org
Mon Sep 6 09:50:00 GMT 2010


With your recent patch, GCC HEAD revision 163907 had problems on:
native: build (about the same as the previous build)
Attached is build output for those targets.
The previous build was of revision 163906.

Log information for changes since the last build:
------------------------------------------------------------------------
r163907 | jakub | 2010-09-06 02:48:10 -0700 (Mon, 06 Sep 2010) | 4 lines
Changed paths:
   M /trunk/gcc/testsuite/ChangeLog
   M /trunk/gcc/testsuite/g++.dg/debug/dwarf2/typedef1.C

	PR testsuite/45543
	* g++.dg/debug/dwarf2/typedef1.C: Expect just one
	DW_TAG_enumeration_type DIE.

------------------------------------------------------------------------

For more information, see <http://glutton.geoffk.org/HEAD/>.

-------------- next part --------------
echo TARGET_SYSTEM_ROOT = '' >> tmp-libgcc.mvars
mv tmp-libgcc.mvars libgcc.mvars
rm -rf libbackend.a
ar rc libbackend.a insn-attrtab.o insn-automata.o insn-emit.o insn-extract.o insn-modes.o insn-opinit.o insn-output.o insn-peep.o insn-preds.o insn-recog.o insn-enums.o ggc-page.o alias.o alloc-pool.o auto-inc-dec.o bb-reorder.o bitmap.o bt-load.o builtins.o caller-save.o calls.o cfg.o cfganal.o cfgbuild.o cfgcleanup.o cfgexpand.o cfghooks.o cfglayout.o cfgloop.o cfgloopanal.o cfgloopmanip.o cfgrtl.o combine.o combine-stack-adj.o convert.o coverage.o cse.o cselib.o dbxout.o dbgcnt.o dce.o ddg.o debug.o df-core.o df-problems.o df-scan.o dfp.o diagnostic.o dojump.o dominance.o domwalk.o double-int.o dse.o dwarf2asm.o dwarf2out.o ebitmap.o emit-rtl.o et-forest.o except.o explow.o expmed.o expr.o final.o fixed-value.o fold-const.o function.o fwprop.o gcse.o ggc-common.o gimple.o gimple-iterator.o gimple-fold.o gimple-low.o gimple-pretty-print.o gimplify.o graph.o graphds.o graphite.o graphite-blocking.o graphite-clast-to-gimple.o graphite-cloog-util.o graphite-dependences.o grap!
 hite-interchange.o graphite-poly.o graphite-ppl.o graphite-scop-detection.o graphite-sese-to-poly.o gtype-desc.o haifa-sched.o hooks.o ifcvt.o implicit-zee.o init-regs.o input.o integrate.o intl.o ira.o ira-build.o ira-costs.o ira-conflicts.o ira-color.o ira-emit.o ira-lives.o jump.o lambda-code.o lambda-mat.o lambda-trans.o langhooks.o lcm.o lists.o loop-doloop.o loop-init.o loop-invariant.o loop-iv.o loop-unroll.o loop-unswitch.o lower-subreg.o lto-cgraph.o lto-streamer-in.o lto-streamer-out.o lto-section-in.o lto-section-out.o lto-symtab.o lto-opts.o lto-streamer.o lto-compress.o mcf.o mode-switching.o modulo-sched.o omega.o omp-low.o optabs.o options.o opts-common.o opts.o params.o passes.o plugin.o pointer-set.o postreload-gcse.o postreload.o predict.o pretty-print.o print-rtl.o print-tree.o profile.o real.o realmpfr.o recog.o reg-stack.o regcprop.o reginfo.o regmove.o regrename.o regstat.o reload.o reload1.o reorg.o resource.o rtl-error.o rtl.o rtlanal.o rtlhooks.o sb!
 itmap.o sched-deps.o sched-ebb.o sched-rgn.o sched-vis.o sdbou!
 t.o sel-
sched-ir.o sel-sched-dump.o sel-sched.o sese.o simplify-rtx.o sparseset.o sreal.o stack-ptr-mod.o statistics.o stmt.o stor-layout.o store-motion.o stringpool.o target-globals.o targhooks.o timevar.o toplev.o tracer.o tree-affine.o tree-call-cdce.o tree-cfg.o tree-cfgcleanup.o tree-chrec.o tree-complex.o tree-data-ref.o tree-dfa.o tree-diagnostic.o tree-dump.o tree-eh.o tree-emutls.o tree-if-conv.o tree-into-ssa.o tree-iterator.o tree-loop-distribution.o tree-loop-linear.o tree-nested.o tree-nrv.o tree-object-size.o tree-optimize.o tree-outof-ssa.o tree-parloops.o tree-phinodes.o tree-predcom.o tree-pretty-print.o tree-profile.o tree-scalar-evolution.o tree-sra.o tree-switch-conversion.o tree-ssa-address.o tree-ssa-alias.o tree-ssa-ccp.o tree-ssa-coalesce.o tree-ssa-copy.o tree-ssa-copyrename.o tree-ssa-dce.o tree-ssa-dom.o tree-ssa-dse.o tree-ssa-forwprop.o tree-ssa-ifcombine.o tree-ssa-live.o tree-ssa-loop-ch.o tree-ssa-loop-im.o tree-ssa-loop-ivcanon.o tree-ssa-loop-ivopts!
 .o tree-ssa-loop-manip.o tree-ssa-loop-niter.o tree-ssa-loop-prefetch.o tree-ssa-loop-unswitch.o tree-ssa-loop.o tree-ssa-math-opts.o tree-ssa-operands.o tree-ssa-phiopt.o tree-ssa-phiprop.o tree-ssa-pre.o tree-ssa-propagate.o tree-ssa-reassoc.o tree-ssa-sccvn.o tree-ssa-sink.o tree-ssa-structalias.o tree-ssa-ter.o tree-ssa-threadedge.o tree-ssa-threadupdate.o tree-ssa-uncprop.o tree-ssa-uninit.o tree-ssa.o tree-ssanames.o tree-stdarg.o tree-tailcall.o tree-vect-generic.o tree-vect-patterns.o tree-vect-data-refs.o tree-vect-stmts.o tree-vect-loop.o tree-vect-loop-manip.o tree-vect-slp.o tree-vectorizer.o tree-vrp.o tree.o value-prof.o var-tracking.o varasm.o vec.o version.o vmsdbgout.o web.o xcoffout.o i386.o  host-linux.o cgraph.o cgraphbuild.o cgraphunit.o cppdefault.o incpath.o ipa-cp.o ipa-split.o ipa-inline.o ipa-prop.o ipa-pure-const.o ipa-reference.o ipa-ref.o ipa-struct-reorg.o ipa-type-escape.o ipa-utils.o ipa.o matrix-reorg.o prefix.o tree-inline.o tree-nomudflap.!
 o varpool.o
ranlib  libbackend.a
gcc   -g -fkeep-inline-functions -DIN_GCC   -W -Wall -Wwrite-strings -Wcast-qual -Wstrict-prototypes -Wmissing-prototypes -Wmissing-format-attribute -Wold-style-definition -Wc++-compat -fno-common  -DHAVE_CONFIG_H  -o cc1-dummy c-lang.o c-family/stub-objc.o attribs.o c-errors.o c-decl.o c-typeck.o c-convert.o c-aux-info.o c-objc-common.o c-parser.o tree-mudflap.o c-family/c-common.o c-family/c-cppbuiltin.o c-family/c-dump.o c-family/c-format.o c-family/c-gimplify.o c-family/c-lex.o c-family/c-omp.o c-family/c-opts.o c-family/c-pch.o c-family/c-ppoutput.o c-family/c-pragma.o c-family/c-pretty-print.o c-family/c-semantics.o c-family/c-ada-spec.o i386-c.o \
	  dummy-checksum.o main.o tree-browser.o libbackend.a ../libcpp/libcpp.a ../libdecnumber/libdecnumber.a ../libcpp/libcpp.a   ../libiberty/libiberty.a ../libdecnumber/libdecnumber.a    -lmpc -lmpfr -lgmp -rdynamic -ldl  -L../zlib -lz -lelf
libbackend.a(sel-sched.o): In function `move_cond_jump':
/home/regress/tbox/svn-gcc/gcc/sel-sched.c:4944: undefined reference to `maybe_tidy_empty_bb'
collect2: ld returned 1 exit status
make[3]: *** [cc1-dummy] Error 1
rm gcov.pod gfdl.pod cpp.pod fsf-funding.pod gcc.pod
make[3]: Leaving directory `/home/regress/tbox/native/build/gcc'
make[2]: *** [all-stage1-gcc] Error 2
make[2]: Leaving directory `/home/regress/tbox/native/build'
make[1]: *** [stage1-bubble] Error 2
make[1]: Leaving directory `/home/regress/tbox/native/build'
make: *** [bootstrap] Error 2
+ '[' -s .bad_compare ']'
+ exit 1
-------------- next part --------------

-- 
Geoffrey Keating <geoffk@geoffk.org> 
(via an automated GCC regression-testing script.)


More information about the Gcc-regression mailing list