GCC build failure, HEAD@163839 on native

GCC regression tester regress@geoffk.org
Fri Sep 3 19:52:00 GMT 2010


With your recent patch, GCC HEAD revision 163839 had problems on:
native: build (about the same as the previous build)
Attached is build output for those targets.
The previous build was of revision 163837.

Log information for changes since the last build:
------------------------------------------------------------------------
r163838 | burnus | 2010-09-03 12:41:11 -0700 (Fri, 03 Sep 2010) | 35 lines
Changed paths:
   M /trunk/gcc/fortran/ChangeLog
   M /trunk/gcc/fortran/trans-expr.c
   M /trunk/gcc/fortran/trans-intrinsic.c
   M /trunk/gcc/fortran/trans-io.c
   M /trunk/gcc/fortran/trans-openmp.c
   M /trunk/gcc/fortran/trans.c

2010-09-03  Tobias Burnus  <burnus@net-b.de>

        PR fortran/45186
        * trans-intrinsic.c (gfc_conv_intrinsic_sign,
        gfc_conv_intrinsic_leadz): Use build_call_expr_loc instead
        of build_call_expr.
        * trans-expr.c (gfc_conv_expr_present, gfc_conv_missing_dummy,
        gfc_conv_string_length, gfc_conv_substring,
        gfc_conv_component_ref, gfc_conv_unary_op, gfc_conv_powi,
        gfc_conv_cst_int_power, gfc_conv_string_tmp, gfc_conv_concat_op,
        gfc_conv_expr_op, gfc_build_compare_string,
        gfc_set_interface_mapping_bounds, gfc_conv_subref_array_arg,
        gfc_conv_derived_to_class, conv_isocbinding_procedure,
        gfc_conv_procedure_call, fill_with_spaces,
        gfc_trans_string_copy, gfc_trans_alloc_subarray_assign,
        gfc_trans_structure_assign, gfc_trans_pointer_assignment,
        gfc_trans_scalar_assign, gfc_trans_zero_assign,
        gfc_trans_array_copy, gfc_trans_array_constructor_copy): Change
        fold_build[0-9] to fold_build[0-9]_loc.
        * trans-io.c (set_parameter_const, set_parameter_value,
        set_parameter_ref, gfc_convert_array_to_string, set_string,
        set_internal_unit, io_result, set_error_locus,
        nml_get_addr_expr, build_dt): Ditto.
        * trans-openmp.c (gfc_omp_clause_default_ctor,
        gfc_omp_clause_copy_ctor, gfc_omp_clause_assign_op,
        gfc_trans_omp_array_reduction, gfc_trans_omp_atomic,
        gfc_trans_omp_do): Ditto.
        * trans.c (gfc_add_modify, gfc_build_addr_expr,
        gfc_build_array_ref, gfc_trans_runtime_error_vararg,
        gfc_trans_runtime_check, gfc_call_malloc,
        gfc_allocate_with_status, gfc_allocate_array_with_status,
        gfc_call_free, gfc_deallocate_with_status,
        gfc_call_realloc): Ditto.


------------------------------------------------------------------------
r163839 | dnovillo | 2010-09-03 12:49:02 -0700 (Fri, 03 Sep 2010) | 6 lines
Changed paths:
   M /trunk/ChangeLog
   M /trunk/configure
   M /trunk/configure.ac

2010-09-03  Jack Howarth <howarth@bromo.med.uc.edu>

	* configure.ac: Enable LTO by default on Darwin.
	* configure: Regenerate.


------------------------------------------------------------------------

For more information, see <http://glutton.geoffk.org/HEAD/>.

-------------- next part --------------
/home/regress/tbox/svn-gcc/libgcc/../gcc/unwind-dw2-fde-glibc.c: In function '_Unwind_IteratePhdrCallback':
/home/regress/tbox/svn-gcc/libgcc/../gcc/unwind-dw2-fde-glibc.c:134:1: error: Invalid first operand of MEM_REF.
D.10501_117
/home/regress/tbox/svn-gcc/libgcc/../gcc/unwind-dw2-fde-glibc.c:134:1: note: in statement
D.11538_238 = &MEM[(struct Elf32_Dyn *)D.10501_117 + 8B];

/home/regress/tbox/svn-gcc/libgcc/../gcc/unwind-dw2-fde-glibc.c:134:1: internal compiler error: verify_stmts failed
Please submit a full bug report,
with preprocessed source if appropriate.
See <http://gcc.gnu.org/bugs.html> for instructions.
make[3]: *** [unwind-dw2-fde-glibc.o] Error 1
make[3]: *** Waiting for unfinished jobs....
make[3]: Leaving directory `/home/regress/tbox/native/build/i686-pc-linux-gnu/libgcc'
make[2]: *** [all-stage1-target-libgcc] Error 2
make[2]: Leaving directory `/home/regress/tbox/native/build'
make[1]: *** [stage1-bubble] Error 2
make[1]: Leaving directory `/home/regress/tbox/native/build'
make: *** [bootstrap] Error 2
+ '[' -s .bad_compare ']'
+ exit 1
-------------- next part --------------

-- 
Geoffrey Keating <geoffk@geoffk.org> 
(via an automated GCC regression-testing script.)


More information about the Gcc-regression mailing list