GCC build failure, HEAD@163835 on native

GCC regression tester regress@geoffk.org
Fri Sep 3 16:22:00 GMT 2010


With your recent patch, GCC HEAD revision 163835 had problems on:
native: build (about the same as the previous build)
Attached is build output for those targets.
The previous build was of revision 163833.

Log information for changes since the last build:
------------------------------------------------------------------------
r163834 | tkoenig | 2010-09-03 09:16:34 -0700 (Fri, 03 Sep 2010) | 15 lines
Changed paths:
   M /trunk/gcc/fortran/ChangeLog
   M /trunk/gcc/fortran/dependency.c
   M /trunk/gcc/fortran/intrinsic.c
   M /trunk/gcc/testsuite/ChangeLog
   A /trunk/gcc/testsuite/gfortran.dg/dependency_34.f90

2010-09-03  Thomas Koenig  <tkoenig@gcc.gnu.org>

	PR fortran/45159
	* dependency.c (gfc_deb_compare_expr):  Compare equal for equal
	arglists for pure user functions, or for those intrinsic
	functions which are also pure.
	* intrinsics.c (add_conv):  Mark conversion functions as pure.
	(add_char_conversions):  Likewise.

2010-09-03  Thomas Koenig  <tkoenig@gcc.gnu.org>

	PR fortran/45159
	* gfortran.dg/dependency_34.f90:  New test.


------------------------------------------------------------------------

For more information, see <http://glutton.geoffk.org/HEAD/>.

-------------- next part --------------
/home/regress/tbox/svn-gcc/libgcc/../gcc/unwind-dw2-fde-glibc.c: In function '_Unwind_IteratePhdrCallback':
/home/regress/tbox/svn-gcc/libgcc/../gcc/unwind-dw2-fde-glibc.c:134:1: error: Invalid first operand of MEM_REF.
D.10501_117
/home/regress/tbox/svn-gcc/libgcc/../gcc/unwind-dw2-fde-glibc.c:134:1: note: in statement
D.11538_238 = &MEM[(struct Elf32_Dyn *)D.10501_117 + 8B];

/home/regress/tbox/svn-gcc/libgcc/../gcc/unwind-dw2-fde-glibc.c:134:1: internal compiler error: verify_stmts failed
Please submit a full bug report,
with preprocessed source if appropriate.
See <http://gcc.gnu.org/bugs.html> for instructions.
make[3]: *** [unwind-dw2-fde-glibc.o] Error 1
make[3]: *** Waiting for unfinished jobs....
make[3]: Leaving directory `/home/regress/tbox/native/build/i686-pc-linux-gnu/libgcc'
make[2]: *** [all-stage1-target-libgcc] Error 2
make[2]: Leaving directory `/home/regress/tbox/native/build'
make[1]: *** [stage1-bubble] Error 2
make[1]: Leaving directory `/home/regress/tbox/native/build'
make: *** [bootstrap] Error 2
+ '[' -s .bad_compare ']'
+ exit 1
-------------- next part --------------

-- 
Geoffrey Keating <geoffk@geoffk.org> 
(via an automated GCC regression-testing script.)


More information about the Gcc-regression mailing list