GCC build failure, HEAD@163822 on native

GCC regression tester regress@geoffk.org
Fri Sep 3 14:46:00 GMT 2010


With your recent patch, GCC HEAD revision 163822 had problems on:
native: build (about the same as the previous build)
Attached is build output for those targets.
The previous build was of revision 163821.

Log information for changes since the last build:
------------------------------------------------------------------------
r163822 | matz | 2010-09-03 07:42:46 -0700 (Fri, 03 Sep 2010) | 11 lines
Changed paths:
   M /trunk/gcc/ChangeLog
   M /trunk/gcc/testsuite/ChangeLog
   A /trunk/gcc/testsuite/gcc.dg/pr45415.c
   M /trunk/gcc/tree-sra.c
   M /trunk/gcc/tree-ssa.c

	PR middle-end/45415
	* tree-sra.c (sra_modify_assign): If we modify the statement,
	say so.

	* tree-ssa.c (verify_ssa): Check number of operands and links
	per statement to agree.

testsuite/
	PR middle-end/45415
	* gcc.dg/pr45415.c: New test.

------------------------------------------------------------------------

For more information, see <http://glutton.geoffk.org/HEAD/>.

-------------- next part --------------
/home/regress/tbox/svn-gcc/libgcc/../gcc/unwind-dw2-fde-glibc.c: In function '_Unwind_IteratePhdrCallback':
/home/regress/tbox/svn-gcc/libgcc/../gcc/unwind-dw2-fde-glibc.c:134:1: error: Invalid first operand of MEM_REF.
D.10501_117
/home/regress/tbox/svn-gcc/libgcc/../gcc/unwind-dw2-fde-glibc.c:134:1: note: in statement
D.11538_238 = &MEM[(struct Elf32_Dyn *)D.10501_117 + 8B];

/home/regress/tbox/svn-gcc/libgcc/../gcc/unwind-dw2-fde-glibc.c:134:1: internal compiler error: verify_stmts failed
Please submit a full bug report,
with preprocessed source if appropriate.
See <http://gcc.gnu.org/bugs.html> for instructions.
make[3]: *** [unwind-dw2-fde-glibc.o] Error 1
make[3]: *** Waiting for unfinished jobs....
make[3]: Leaving directory `/home/regress/tbox/native/build/i686-pc-linux-gnu/libgcc'
make[2]: *** [all-stage1-target-libgcc] Error 2
make[2]: Leaving directory `/home/regress/tbox/native/build'
make[1]: *** [stage1-bubble] Error 2
make[1]: Leaving directory `/home/regress/tbox/native/build'
make: *** [bootstrap] Error 2
+ '[' -s .bad_compare ']'
+ exit 1
-------------- next part --------------

-- 
Geoffrey Keating <geoffk@geoffk.org> 
(via an automated GCC regression-testing script.)


More information about the Gcc-regression mailing list