GCC build failure, HEAD@163820 on native

GCC regression tester regress@geoffk.org
Fri Sep 3 14:42:00 GMT 2010

With your recent patch, GCC HEAD revision 163820 had problems on:
native: build (about the same as the previous build)
Attached is build output for those targets.
The previous build was of revision 163819.

Log information for changes since the last build:
r163820 | uros | 2010-09-03 07:33:48 -0700 (Fri, 03 Sep 2010) | 6 lines
Changed paths:
   M /trunk/libgcc/ChangeLog
   M /trunk/libgcc/config/i386/libgcc-sol2.ver

	* config/i386/t-sol2 (__copysigntf3, __fabstf3): Disable for
	64bit targets.
	(__fixtfti, __fixunstfti, __floattitf, __floatuntitf): Enable only
	for 64bit targets.


For more information, see <http://glutton.geoffk.org/HEAD/>.

-------------- next part --------------
/home/regress/tbox/svn-gcc/libgcc/../gcc/unwind-dw2-fde-glibc.c: In function '_Unwind_IteratePhdrCallback':
/home/regress/tbox/svn-gcc/libgcc/../gcc/unwind-dw2-fde-glibc.c:134:1: error: Invalid first operand of MEM_REF.
/home/regress/tbox/svn-gcc/libgcc/../gcc/unwind-dw2-fde-glibc.c:134:1: note: in statement
D.11538_238 = &MEM[(struct Elf32_Dyn *)D.10501_117 + 8B];

/home/regress/tbox/svn-gcc/libgcc/../gcc/unwind-dw2-fde-glibc.c:134:1: internal compiler error: verify_stmts failed
Please submit a full bug report,
with preprocessed source if appropriate.
See <http://gcc.gnu.org/bugs.html> for instructions.
make[3]: *** [unwind-dw2-fde-glibc.o] Error 1
make[3]: *** Waiting for unfinished jobs....
make[3]: Leaving directory `/home/regress/tbox/native/build/i686-pc-linux-gnu/libgcc'
make[2]: *** [all-stage1-target-libgcc] Error 2
make[2]: Leaving directory `/home/regress/tbox/native/build'
make[1]: *** [stage1-bubble] Error 2
make[1]: Leaving directory `/home/regress/tbox/native/build'
make: *** [bootstrap] Error 2
+ '[' -s .bad_compare ']'
+ exit 1
-------------- next part --------------

Geoffrey Keating <geoffk@geoffk.org> 
(via an automated GCC regression-testing script.)

More information about the Gcc-regression mailing list