GCC build failure, HEAD@161536 on native

GCC regression tester regress@geoffk.org
Tue Jun 29 14:24:00 GMT 2010


With your recent patch, GCC HEAD revision 161536 had problems on:
native: build (about the same as the previous build)
Attached is build output for those targets.
The previous build was of revision 161535.

Log information for changes since the last build:
------------------------------------------------------------------------
r161536 | hubicka | 2010-06-29 07:14:15 -0700 (Tue, 29 Jun 2010) | 10 lines
Changed paths:
   M /trunk/gcc/ChangeLog
   M /trunk/gcc/passes.c
   M /trunk/gcc/predict.c
   M /trunk/gcc/predict.h
   M /trunk/gcc/testsuite/ChangeLog
   A /trunk/gcc/testsuite/gcc.dg/tree-ssa/ipa-split-3.c
   M /trunk/gcc/tree-inline.c

	* predict.c (propagate_freq): Clear EXIT_BLOCK_PTR frequency if it is
	unreachable.
	(rebuild_frequencies): New function.
	* predict.h (rebuild_frequencies): Declare.
	* tree-inline.c (copy_cfg_body): Compute properly count & frequency of
	entry block and edge reaching new_entry.
	(tree_function_versioning): When doing partial cloning, rebuild frequencies
	when done.
	* passes.c (execute_function_todo): Use rebild_frequencies.

------------------------------------------------------------------------

For more information, see <http://glutton.geoffk.org/HEAD/>.

-------------- next part --------------
/home/regress/tbox/svn-gcc/gcc/config/i386/i386.c: At top level:
/home/regress/tbox/svn-gcc/gcc/config/i386/i386.c:30995:8: error: initialization from incompatible pointer type [-Werror]
/home/regress/tbox/svn-gcc/gcc/config/i386/i386.c:30995:8: error: (near initialization for 'targetm.calls.function_arg_advance') [-Werror]
/home/regress/tbox/svn-gcc/gcc/config/i386/i386.c:30995:8: error: initialization from incompatible pointer type [-Werror]
/home/regress/tbox/svn-gcc/gcc/config/i386/i386.c:30995:8: error: (near initialization for 'targetm.calls.function_arg') [-Werror]
/home/regress/tbox/svn-gcc/gcc/config/i386/i386.c:30995:8: error: initialization from incompatible pointer type [-Werror]
/home/regress/tbox/svn-gcc/gcc/config/i386/i386.c:30995:8: error: (near initialization for 'targetm.calls.function_incoming_arg') [-Werror]
cc1: all warnings being treated as errors

make[3]: *** [i386.o] Error 1
make[3]: *** Waiting for unfinished jobs....
rm gcj-dbtool.pod jcf-dump.pod jv-convert.pod grmic.pod gcov.pod gcj.pod gc-analyze.pod gfdl.pod cpp.pod gij.pod gfortran.pod fsf-funding.pod gcc.pod
make[3]: Leaving directory `/home/regress/tbox/native/build/gcc'
make[2]: *** [all-stage2-gcc] Error 2
make[2]: Leaving directory `/home/regress/tbox/native/build'
make[1]: *** [stage2-bubble] Error 2
make[1]: Leaving directory `/home/regress/tbox/native/build'
make: *** [bootstrap] Error 2
+ '[' -s .bad_compare ']'
+ exit 1
-------------- next part --------------

-- 
Geoffrey Keating <geoffk@geoffk.org> 
(via an automated GCC regression-testing script.)


More information about the Gcc-regression mailing list