GCC build failure, HEAD@158825 on native

regress regress@apple.com
Wed Apr 28 14:25:00 GMT 2010


With your recent patch, GCC HEAD revision 158825 had problems on:
native: build (about the same as the previous build)
Attached is build output for those targets.
The previous build was of revision 158824.

Log information for changes since the last build:
------------------------------------------------------------------------
r158825 | rguenth | 2010-04-28 04:51:31 -0700 (Wed, 28 Apr 2010) | 19 lines
Changed paths:
   M /trunk/gcc/ChangeLog
   M /trunk/gcc/testsuite/ChangeLog
   M /trunk/gcc/testsuite/gcc.dg/ipa/ipa-pta-14.c
   M /trunk/gcc/tree-ssa-structalias.c

2010-04-28  Richard Guenther  <rguenther@suse.de>

	PR tree-optimization/43879
	PR tree-optimization/43909
	* tree-ssa-structalias.c (struct variable_info): Add
	only_restrict_pointers flag.
	(new_var_info): Initialize it.  Increment stats.total_vars here.
	(create_function_info_for): Do not increment stats.total_vars
	here.
	(get_function_part_constraint): Fix build with C++.
	(insert_into_field_list): Remove.
	(push_fields_onto_fieldstack): Properly merge fields.
	(create_variable_info_for): Split and simplify.
	(create_variable_info_for_1): New piece.
	(intra_create_variable_infos): Properly make restrict constraints
	from parameters.

	* gcc.dg/ipa/ipa-pta-14.c: Adjust.

------------------------------------------------------------------------

For more information, see <http://gcc.gnu.org/regtest/HEAD/>.

-------------- next part --------------
checking for --enable-version-specific-runtime-libs... no
checking for a BSD-compatible install... /usr/bin/install -c
checking for gawk... gawk
checking build system type... powerpc-apple-darwin9.8.0
checking host system type... powerpc-apple-darwin9.8.0
checking for powerpc-apple-darwin9.8.0-ar... ar
checking for powerpc-apple-darwin9.8.0-lipo... lipo
checking for powerpc-apple-darwin9.8.0-nm... /Users/regress/tbox/native/build/./gcc/nm
checking for powerpc-apple-darwin9.8.0-ranlib... ranlib -c
checking for powerpc-apple-darwin9.8.0-strip... strip
checking whether ln -s works... yes
checking for powerpc-apple-darwin9.8.0-gcc... /Users/regress/tbox/native/build/./gcc/xgcc -B/Users/regress/tbox/native/build/./gcc/ -B/Users/regress/tbox/objs/powerpc-apple-darwin9.8.0/bin/ -B/Users/regress/tbox/objs/powerpc-apple-darwin9.8.0/lib/ -isystem /Users/regress/tbox/objs/powerpc-apple-darwin9.8.0/include -isystem /Users/regress/tbox/objs/powerpc-apple-darwin9.8.0/sys-include   
checking for suffix of object files... configure: error: in `/Users/regress/tbox/native/build/powerpc-apple-darwin9.8.0/libgcc':
configure: error: cannot compute suffix of object files: cannot compile
See `config.log' for more details.
make[2]: *** [configure-stage2-target-libgcc] Error 1
make[1]: *** [stage2-bubble] Error 2
make: *** [bootstrap] Error 2
+ '[' -s .bad_compare ']'
+ exit 1
-------------- next part --------------

-- 
Geoffrey Keating <geoffk@apple.com> 
(via an automated GCC regression-testing script.)


More information about the Gcc-regression mailing list