GCC build failure, HEAD@158824 on native

regress regress@apple.com
Wed Apr 28 12:32:00 GMT 2010


With your recent patch, GCC HEAD revision 158824 had problems on:
native: build (about the same as the previous build)
Attached is build output for those targets.
The previous build was of revision 158823.

Log information for changes since the last build:
------------------------------------------------------------------------
r158824 | rguenth | 2010-04-28 03:28:24 -0700 (Wed, 28 Apr 2010) | 8 lines
Changed paths:
   M /trunk/gcc/ChangeLog
   M /trunk/gcc/testsuite/ChangeLog
   A /trunk/gcc/testsuite/g++.dg/torture/pr43880.C
   M /trunk/gcc/tree-inline.c

2010-04-28  Richard Guenther  <rguenther@suse.de>

	PR c++/43880
	* tree-inline.c (copy_bind_expr): Also copy bind expr vars
	value-exprs.

	* g++.dg/torture/pr43880.C: New testcase.

------------------------------------------------------------------------

For more information, see <http://gcc.gnu.org/regtest/HEAD/>.

-------------- next part --------------
checking for --enable-version-specific-runtime-libs... no
checking for a BSD-compatible install... /usr/bin/install -c
checking for gawk... gawk
checking build system type... powerpc-apple-darwin9.8.0
checking host system type... powerpc-apple-darwin9.8.0
checking for powerpc-apple-darwin9.8.0-ar... ar
checking for powerpc-apple-darwin9.8.0-lipo... lipo
checking for powerpc-apple-darwin9.8.0-nm... /Users/regress/tbox/native/build/./gcc/nm
checking for powerpc-apple-darwin9.8.0-ranlib... ranlib -c
checking for powerpc-apple-darwin9.8.0-strip... strip
checking whether ln -s works... yes
checking for powerpc-apple-darwin9.8.0-gcc... /Users/regress/tbox/native/build/./gcc/xgcc -B/Users/regress/tbox/native/build/./gcc/ -B/Users/regress/tbox/objs/powerpc-apple-darwin9.8.0/bin/ -B/Users/regress/tbox/objs/powerpc-apple-darwin9.8.0/lib/ -isystem /Users/regress/tbox/objs/powerpc-apple-darwin9.8.0/include -isystem /Users/regress/tbox/objs/powerpc-apple-darwin9.8.0/sys-include   
checking for suffix of object files... configure: error: in `/Users/regress/tbox/native/build/powerpc-apple-darwin9.8.0/libgcc':
configure: error: cannot compute suffix of object files: cannot compile
See `config.log' for more details.
make[2]: *** [configure-stage2-target-libgcc] Error 1
make[1]: *** [stage2-bubble] Error 2
make: *** [bootstrap] Error 2
+ '[' -s .bad_compare ']'
+ exit 1
-------------- next part --------------

-- 
Geoffrey Keating <geoffk@apple.com> 
(via an automated GCC regression-testing script.)


More information about the Gcc-regression mailing list