GCC build failure, HEAD@158792 on native

regress regress@apple.com
Tue Apr 27 20:02:00 GMT 2010


With your recent patch, GCC HEAD revision 158792 had problems on:
native: build (about the same as the previous build)
Attached is build output for those targets.
The previous build was of revision 158788.

Log information for changes since the last build:
------------------------------------------------------------------------
r158789 | aph | 2010-04-27 09:35:06 -0700 (Tue, 27 Apr 2010) | 11 lines
Changed paths:
   M /trunk/libjava/classpath/ChangeLog
   M /trunk/libjava/classpath/gnu/javax/print/ipp/IppPrintService.java
   M /trunk/libjava/classpath/gnu/javax/print/ipp/IppRequest.java
   M /trunk/libjava/classpath/gnu/javax/print/ipp/IppResponse.java
   M /trunk/libjava/classpath/lib/gnu/javax/print/ipp/IppPrintService.class
   M /trunk/libjava/classpath/lib/gnu/javax/print/ipp/IppRequest$RequestWriter.class
   M /trunk/libjava/classpath/lib/gnu/javax/print/ipp/IppRequest.class
   M /trunk/libjava/classpath/lib/gnu/javax/print/ipp/IppResponse$ResponseReader.class
   M /trunk/libjava/classpath/lib/gnu/javax/print/ipp/IppResponse.class

2010-04-27  Andrew Haley  <aph@redhat.com>

        * gnu/javax/print/ipp/IppResponse.java (parseAttributes): Handle
        IppValueTag.UNKNOWN.  
        * gnu/javax/print/ipp/IppRequest.java (writeOperationAttributes):
        Handle RequestedAttributes.
        * gnu/javax/print/ipp/IppPrintService.java (processResponse): Add
        DocFlavor.SERVICE_FORMATTED.PAGEABLE and
        DocFlavor.SERVICE_FORMATTED.PRINTABLE.


------------------------------------------------------------------------
r158790 | aph | 2010-04-27 10:28:08 -0700 (Tue, 27 Apr 2010) | 6 lines
Changed paths:
   M /trunk/libjava/classpath/ChangeLog
   M /trunk/libjava/classpath/java/util/concurrent/CopyOnWriteArrayList.java
   M /trunk/libjava/classpath/lib/java/util/concurrent/CopyOnWriteArrayList$1.class
   M /trunk/libjava/classpath/lib/java/util/concurrent/CopyOnWriteArrayList$2.class
   M /trunk/libjava/classpath/lib/java/util/concurrent/CopyOnWriteArrayList$3.class
   M /trunk/libjava/classpath/lib/java/util/concurrent/CopyOnWriteArrayList$RandomAccessSubList.class
   M /trunk/libjava/classpath/lib/java/util/concurrent/CopyOnWriteArrayList$SubList.class
   M /trunk/libjava/classpath/lib/java/util/concurrent/CopyOnWriteArrayList.class

2010-04-27  Andrew Haley  <aph@redhat.com>

        * java/util/concurrent/CopyOnWriteArrayList.java: Fix for empty
        list.


------------------------------------------------------------------------
r158791 | ktietz | 2010-04-27 10:48:58 -0700 (Tue, 27 Apr 2010) | 24 lines
Changed paths:
   M /trunk/gcc/ChangeLog
   M /trunk/gcc/collect2.c
   M /trunk/gcc/config/i386/cygming.h
   M /trunk/gcc/config/i386/i386.h
   M /trunk/gcc/config/i386/mingw-w64.h
   M /trunk/gcc/config/i386/mingw32.h
   M /trunk/gcc/config.in
   M /trunk/gcc/configure
   M /trunk/gcc/configure.ac
   M /trunk/gcc/tlink.c

2010-04-27  Kai Tietz  <kai.tietz@onevision.com>

        * collect2.c (TARGET_64BIT): Redefine to target's default.
        * tlink.c: Likewise.
        * config/i386/cygming.h (USER_LABEL_PREFIX): Define
        dependent to TARGET_64BIT and USE_MINGW64_LEADING_UNDERSCORES.
        * config/i386/i386.h (CRT_CALL_STATIC_FUNCTION): Use
        for underscoring __USER_LABEL_PREFIX__.
        * config/i386/mingw-w64.h (SUB_LINK_ENTRY): New macro.
        (SUB_LINK_ENTRY32): New.
        (SUB_LINK_ENTRY64): New.
        (LINK_SPEC): Replace entry point spec by
        SUB_LINK_ENTRY.
        * config/i386/mingw32 (SUB_LINK_ENTRY32): New.
        (SUB_LINK_ENTRY64): New.
        (SUB_LINK_ENTRY): New.
        (LINK_SPEC): Use SUB_LINK_ENTRY instead of hard-coded entry-point.
        (DWARF2_UNWIND_INFO): Error out for use of dw2 unwind when
        x64 target is choosen.
        * config.in (USE_MINGW64_LEADING_UNDERSCORES): New.
        * configure: Regenerated.
        * configure.ac (leading-mingw64-underscores): Option added.


------------------------------------------------------------------------
r158792 | ebotcazou | 2010-04-27 10:56:52 -0700 (Tue, 27 Apr 2010) | 2 lines
Changed paths:
   M /trunk/gcc/ChangeLog
   M /trunk/gcc/tree.h

	* tree.h: Fix truncated long macros.

------------------------------------------------------------------------

For more information, see <http://gcc.gnu.org/regtest/HEAD/>.

-------------- next part --------------
checking for --enable-version-specific-runtime-libs... no
checking for a BSD-compatible install... /usr/bin/install -c
checking for gawk... gawk
checking build system type... powerpc-apple-darwin9.8.0
checking host system type... powerpc-apple-darwin9.8.0
checking for powerpc-apple-darwin9.8.0-ar... ar
checking for powerpc-apple-darwin9.8.0-lipo... lipo
checking for powerpc-apple-darwin9.8.0-nm... /Users/regress/tbox/native/build/./gcc/nm
checking for powerpc-apple-darwin9.8.0-ranlib... ranlib -c
checking for powerpc-apple-darwin9.8.0-strip... strip
checking whether ln -s works... yes
checking for powerpc-apple-darwin9.8.0-gcc... /Users/regress/tbox/native/build/./gcc/xgcc -B/Users/regress/tbox/native/build/./gcc/ -B/Users/regress/tbox/objs/powerpc-apple-darwin9.8.0/bin/ -B/Users/regress/tbox/objs/powerpc-apple-darwin9.8.0/lib/ -isystem /Users/regress/tbox/objs/powerpc-apple-darwin9.8.0/include -isystem /Users/regress/tbox/objs/powerpc-apple-darwin9.8.0/sys-include   
checking for suffix of object files... configure: error: in `/Users/regress/tbox/native/build/powerpc-apple-darwin9.8.0/libgcc':
configure: error: cannot compute suffix of object files: cannot compile
See `config.log' for more details.
make[2]: *** [configure-stage2-target-libgcc] Error 1
make[1]: *** [stage2-bubble] Error 2
make: *** [bootstrap] Error 2
+ '[' -s .bad_compare ']'
+ exit 1
-------------- next part --------------

-- 
Geoffrey Keating <geoffk@apple.com> 
(via an automated GCC regression-testing script.)


More information about the Gcc-regression mailing list