GCC build failure, HEAD@158768 on native

regress regress@apple.com
Tue Apr 27 10:38:00 GMT 2010


With your recent patch, GCC HEAD revision 158768 had problems on:
native: build (about the same as the previous build)
Attached is build output for those targets.
The previous build was of revision 158766.

Log information for changes since the last build:
------------------------------------------------------------------------
r158768 | burnus | 2010-04-27 01:41:00 -0700 (Tue, 27 Apr 2010) | 20 lines
Changed paths:
   M /trunk/gcc/fortran/ChangeLog
   M /trunk/gcc/fortran/resolve.c
   M /trunk/gcc/fortran/trans-array.c
   M /trunk/gcc/fortran/trans-stmt.c
   M /trunk/gcc/fortran/trans-types.c
   M /trunk/gcc/fortran/trans-types.h
   M /trunk/gcc/testsuite/ChangeLog
   A /trunk/gcc/testsuite/gfortran.dg/coarray_12.f90
   M /trunk/gcc/testsuite/gfortran.dg/coarray_7.f90

2010-04-27  Tobias Burnus  <burnus@net-b.de>

        PR fortran/18918
        * resolve.c (resolve_allocate_expr): Allow array coarrays.
        * trans-types.h (gfc_get_array_type_bounds): Update prototype.
        * trans-types.c (gfc_get_array_type_bounds,
        gfc_get_array_descriptor_base): Add corank argument.
        * trans-array.c (gfc_array_init_size): Handle corank.
        (gfc_trans_create_temp_array, gfc_array_allocate,
        gfc_conv_expr_descriptor): Add corank argument to call.
        * trans-stmt.c (gfc_trans_pointer_assign_need_temp): Ditto.

2010-04-27  Tobias Burnus  <burnus@net-b.de>

        PR fortran/18918
        * gfortran.dg/coarray_7.f90: Modified and removed obsolete
        tests.
        * gfortran.dg/coarray_12.f90: New.


------------------------------------------------------------------------

For more information, see <http://gcc.gnu.org/regtest/HEAD/>.

-------------- next part --------------
checking for --enable-version-specific-runtime-libs... no
checking for a BSD-compatible install... /usr/bin/install -c
checking for gawk... gawk
checking build system type... powerpc-apple-darwin9.8.0
checking host system type... powerpc-apple-darwin9.8.0
checking for powerpc-apple-darwin9.8.0-ar... ar
checking for powerpc-apple-darwin9.8.0-lipo... lipo
checking for powerpc-apple-darwin9.8.0-nm... /Users/regress/tbox/native/build/./gcc/nm
checking for powerpc-apple-darwin9.8.0-ranlib... ranlib -c
checking for powerpc-apple-darwin9.8.0-strip... strip
checking whether ln -s works... yes
checking for powerpc-apple-darwin9.8.0-gcc... /Users/regress/tbox/native/build/./gcc/xgcc -B/Users/regress/tbox/native/build/./gcc/ -B/Users/regress/tbox/objs/powerpc-apple-darwin9.8.0/bin/ -B/Users/regress/tbox/objs/powerpc-apple-darwin9.8.0/lib/ -isystem /Users/regress/tbox/objs/powerpc-apple-darwin9.8.0/include -isystem /Users/regress/tbox/objs/powerpc-apple-darwin9.8.0/sys-include   
checking for suffix of object files... configure: error: in `/Users/regress/tbox/native/build/powerpc-apple-darwin9.8.0/libgcc':
configure: error: cannot compute suffix of object files: cannot compile
See `config.log' for more details.
make[2]: *** [configure-stage2-target-libgcc] Error 1
make[1]: *** [stage2-bubble] Error 2
make: *** [bootstrap] Error 2
+ '[' -s .bad_compare ']'
+ exit 1
-------------- next part --------------

-- 
Geoffrey Keating <geoffk@apple.com> 
(via an automated GCC regression-testing script.)


More information about the Gcc-regression mailing list