GCC build failure, HEAD@158761 on native

regress regress@apple.com
Tue Apr 27 03:31:00 GMT 2010


With your recent patch, GCC HEAD revision 158761 had problems on:
native: build (about the same as the previous build)
Attached is build output for those targets.
The previous build was of revision 158751.

Log information for changes since the last build:
------------------------------------------------------------------------
r158752 | mrs | 2010-04-26 17:08:28 -0700 (Mon, 26 Apr 2010) | 19 lines
Changed paths:
   M /trunk/gcc/testsuite/ChangeLog
   M /trunk/gcc/testsuite/lib/dg-pch.exp
   M /trunk/gcc/testsuite/lib/objc-torture.exp
   M /trunk/gcc/testsuite/obj-c++.dg/stubify-1.mm
   M /trunk/gcc/testsuite/obj-c++.dg/stubify-2.mm
   M /trunk/gcc/testsuite/objc.dg/next-runtime-1.m
   M /trunk/gcc/testsuite/objc.dg/pch/pch.exp
   M /trunk/gcc/testsuite/objc.dg/stret-2.m
   M /trunk/gcc/testsuite/objc.dg/stubify-1.m
   M /trunk/gcc/testsuite/objc.dg/stubify-2.m
   M /trunk/gcc/testsuite/objc.dg/symtab-1.m

2010-04-26  Iain Sandoe  <iain.sandoe@sandoe-acoustics.co.uk>

	PR testsuite/35165
	* obj-c++.dg/stubify-2.mm: Restrict to ilp32 targets.  Require
	Darwin8/OSX10.4 - compatible code generation.
	Use scan-rtl-dump.
	* obj-c++.dg/stubify-1.mm: Ditto.
	* lib/objc-torture.exp: Do not require link success for
	"trivial.m" in the runtime checks when dowhat = 'compile'.
	* lib/dg-pch.exp: (dg-flags-pch): New Proc.
	* objc.dg/stubify-1.m:  Restrict to ilp32 targets.  Require
	Darwin8/OSX10.4 - compatible code generation.
	* objc.dg/stubify-2.m: Ditto.
	* objc.dg/symtab-1.m: Match '.quad' for m64 code.
	* objc.dg/next-runtime-1.m: Ditto.
	* objc.dg/stret-2.m: Restrict to ilp32 targets.
	* objc.dg/pch/pch.exp: Apply tests to both Gnu and NeXT
	runtimes on Darwin.

------------------------------------------------------------------------
r158756 | gccadmin | 2010-04-26 17:20:35 -0700 (Mon, 26 Apr 2010) | 1 line
Changed paths:
   M /trunk/gcc/DATESTAMP

Daily bump.
------------------------------------------------------------------------
r158757 | hjl | 2010-04-26 17:25:18 -0700 (Mon, 26 Apr 2010) | 7 lines
Changed paths:
   M /trunk/gcc/testsuite/ChangeLog
   A /trunk/gcc/testsuite/gcc.dg/tree-ssa/tailcall-6.c

Add a run-time testcase for PR tree-optimization/43904.

2010-04-26  H.J. Lu  <hongjiu.lu@intel.com>

	PR tree-optimization/43904
	* gcc.dg/tree-ssa/tailcall-6.c: New.

------------------------------------------------------------------------
r158759 | hp | 2010-04-26 17:55:30 -0700 (Mon, 26 Apr 2010) | 3 lines
Changed paths:
   M /trunk/gcc/ChangeLog
   M /trunk/gcc/config/mmix/mmix.md

	* config/mmix/mmix.md ("*divdi3_nonknuth", "*moddi3_nonknuth"):
	Add missing earlyclobber for second alternative.

------------------------------------------------------------------------
r158760 | hp | 2010-04-26 17:56:41 -0700 (Mon, 26 Apr 2010) | 4 lines
Changed paths:
   M /trunk/gcc/ChangeLog

	PR target/43889
	* config/mmix/mmix.md ("*divdi3_nonknuth", "*moddi3_nonknuth"):
	Add missing earlyclobber for second alternative.

------------------------------------------------------------------------

For more information, see <http://gcc.gnu.org/regtest/HEAD/>.

-------------- next part --------------
checking for --enable-version-specific-runtime-libs... no
checking for a BSD-compatible install... /usr/bin/install -c
checking for gawk... gawk
checking build system type... powerpc-apple-darwin9.8.0
checking host system type... powerpc-apple-darwin9.8.0
checking for powerpc-apple-darwin9.8.0-ar... ar
checking for powerpc-apple-darwin9.8.0-lipo... lipo
checking for powerpc-apple-darwin9.8.0-nm... /Users/regress/tbox/native/build/./gcc/nm
checking for powerpc-apple-darwin9.8.0-ranlib... ranlib -c
checking for powerpc-apple-darwin9.8.0-strip... strip
checking whether ln -s works... yes
checking for powerpc-apple-darwin9.8.0-gcc... /Users/regress/tbox/native/build/./gcc/xgcc -B/Users/regress/tbox/native/build/./gcc/ -B/Users/regress/tbox/objs/powerpc-apple-darwin9.8.0/bin/ -B/Users/regress/tbox/objs/powerpc-apple-darwin9.8.0/lib/ -isystem /Users/regress/tbox/objs/powerpc-apple-darwin9.8.0/include -isystem /Users/regress/tbox/objs/powerpc-apple-darwin9.8.0/sys-include   
checking for suffix of object files... configure: error: in `/Users/regress/tbox/native/build/powerpc-apple-darwin9.8.0/libgcc':
configure: error: cannot compute suffix of object files: cannot compile
See `config.log' for more details.
make[2]: *** [configure-stage2-target-libgcc] Error 1
make[1]: *** [stage2-bubble] Error 2
make: *** [bootstrap] Error 2
+ '[' -s .bad_compare ']'
+ exit 1
-------------- next part --------------

-- 
Geoffrey Keating <geoffk@apple.com> 
(via an automated GCC regression-testing script.)


More information about the Gcc-regression mailing list