GCC build failure, HEAD@158751 on native

regress regress@apple.com
Tue Apr 27 01:38:00 GMT 2010


With your recent patch, GCC HEAD revision 158751 had problems on:
native: build (about the same as the previous build)
Attached is build output for those targets.
The previous build was of revision 158750.

Log information for changes since the last build:
------------------------------------------------------------------------
r158751 | redi | 2010-04-26 16:33:32 -0700 (Mon, 26 Apr 2010) | 6 lines
Changed paths:
   M /trunk/libstdc++-v3/ChangeLog
   M /trunk/libstdc++-v3/doc/html/manual/abi.html
   M /trunk/libstdc++-v3/doc/html/manual/algorithms.html
   M /trunk/libstdc++-v3/doc/html/manual/api.html
   M /trunk/libstdc++-v3/doc/html/manual/appendix_contributing.html
   M /trunk/libstdc++-v3/doc/html/manual/appendix_free.html
   M /trunk/libstdc++-v3/doc/html/manual/appendix_gpl.html
   M /trunk/libstdc++-v3/doc/html/manual/appendix_porting.html
   M /trunk/libstdc++-v3/doc/html/manual/atomics.html
   M /trunk/libstdc++-v3/doc/html/manual/backwards.html
   M /trunk/libstdc++-v3/doc/html/manual/bitmap_allocator.html
   M /trunk/libstdc++-v3/doc/html/manual/bk01pt03ch17s03.html
   M /trunk/libstdc++-v3/doc/html/manual/bk01pt03ch18s03.html
   M /trunk/libstdc++-v3/doc/html/manual/bk01pt03ch19s02.html
   M /trunk/libstdc++-v3/doc/html/manual/bk01pt03ch19s07.html
   M /trunk/libstdc++-v3/doc/html/manual/bk01pt03pr01.html
   M /trunk/libstdc++-v3/doc/html/manual/concurrency.html
   M /trunk/libstdc++-v3/doc/html/manual/containers.html
   M /trunk/libstdc++-v3/doc/html/manual/diagnostics.html
   M /trunk/libstdc++-v3/doc/html/manual/documentation_style.html
   M /trunk/libstdc++-v3/doc/html/manual/extensions.html
   M /trunk/libstdc++-v3/doc/html/manual/facets.html
   M /trunk/libstdc++-v3/doc/html/manual/intro.html
   M /trunk/libstdc++-v3/doc/html/manual/io.html
   M /trunk/libstdc++-v3/doc/html/manual/iterators.html
   M /trunk/libstdc++-v3/doc/html/manual/localization.html
   M /trunk/libstdc++-v3/doc/html/manual/memory.html
   M /trunk/libstdc++-v3/doc/html/manual/numerics.html
   M /trunk/libstdc++-v3/doc/html/manual/parallel_mode.html
   M /trunk/libstdc++-v3/doc/html/manual/profile_mode.html
   M /trunk/libstdc++-v3/doc/html/manual/spine.html
   M /trunk/libstdc++-v3/doc/html/manual/status.html
   M /trunk/libstdc++-v3/doc/html/manual/strings.html
   M /trunk/libstdc++-v3/doc/html/manual/support.html
   M /trunk/libstdc++-v3/doc/html/manual/test.html
   M /trunk/libstdc++-v3/doc/html/manual/using.html
   M /trunk/libstdc++-v3/doc/html/manual/using_exceptions.html
   M /trunk/libstdc++-v3/doc/html/manual/using_headers.html
   M /trunk/libstdc++-v3/doc/html/manual/utilities.html
   M /trunk/libstdc++-v3/doc/xml/manual/status_cxx200x.xml

2010-04-27  Jonathan Wakely  <jwakely.gcc@gmail.com>

	* doc/xml/manual/status_cxx200x.xml: Update to match n3092.
	* doc/html/*: Regenerate.


------------------------------------------------------------------------

For more information, see <http://gcc.gnu.org/regtest/HEAD/>.

-------------- next part --------------
checking for --enable-version-specific-runtime-libs... no
checking for a BSD-compatible install... /usr/bin/install -c
checking for gawk... gawk
checking build system type... powerpc-apple-darwin9.8.0
checking host system type... powerpc-apple-darwin9.8.0
checking for powerpc-apple-darwin9.8.0-ar... ar
checking for powerpc-apple-darwin9.8.0-lipo... lipo
checking for powerpc-apple-darwin9.8.0-nm... /Users/regress/tbox/native/build/./gcc/nm
checking for powerpc-apple-darwin9.8.0-ranlib... ranlib -c
checking for powerpc-apple-darwin9.8.0-strip... strip
checking whether ln -s works... yes
checking for powerpc-apple-darwin9.8.0-gcc... /Users/regress/tbox/native/build/./gcc/xgcc -B/Users/regress/tbox/native/build/./gcc/ -B/Users/regress/tbox/objs/powerpc-apple-darwin9.8.0/bin/ -B/Users/regress/tbox/objs/powerpc-apple-darwin9.8.0/lib/ -isystem /Users/regress/tbox/objs/powerpc-apple-darwin9.8.0/include -isystem /Users/regress/tbox/objs/powerpc-apple-darwin9.8.0/sys-include   
checking for suffix of object files... configure: error: in `/Users/regress/tbox/native/build/powerpc-apple-darwin9.8.0/libgcc':
configure: error: cannot compute suffix of object files: cannot compile
See `config.log' for more details.
make[2]: *** [configure-stage2-target-libgcc] Error 1
make[1]: *** [stage2-bubble] Error 2
make: *** [bootstrap] Error 2
+ '[' -s .bad_compare ']'
+ exit 1
-------------- next part --------------

-- 
Geoffrey Keating <geoffk@apple.com> 
(via an automated GCC regression-testing script.)


More information about the Gcc-regression mailing list