GCC build failure, HEAD@158741 on native

regress regress@apple.com
Mon Apr 26 19:25:00 GMT 2010


With your recent patch, GCC HEAD revision 158741 had problems on:
native: build (about the same as the previous build)
Attached is build output for those targets.
The previous build was of revision 158736.

Log information for changes since the last build:
------------------------------------------------------------------------
r158737 | ebotcazou | 2010-04-26 09:32:45 -0700 (Mon, 26 Apr 2010) | 4 lines
Changed paths:
   M /trunk/gcc/ChangeLog
   M /trunk/gcc/gimplify.c

	* gimplify.c (gimplify_cond_expr): Use THEN_ and ELSE_ local variables.
	Use VOID_TYPE_P for all void type tests.  Adjust TYPE variable instead
	of shadowing it.  Fix comments.

------------------------------------------------------------------------
r158738 | ebotcazou | 2010-04-26 09:39:24 -0700 (Mon, 26 Apr 2010) | 6 lines
Changed paths:
   M /trunk/gcc/ChangeLog
   M /trunk/gcc/config/arm/unknown-elf.h
   M /trunk/gcc/varasm.c

	* varasm.c (IN_NAMED_SECTION): Remove guard.
	* config/arm/unknown-elf.h (IN_NAMED_SECTION): Rename to...
	(IN_NAMED_SECTION_P): ...this.
	(ASM_OUTPUT_ALIGNED_BSS): Adjust for above renaming.
	(ASM_OUTPUT_ALIGNED_DECL_LOCAL): Likewise.

------------------------------------------------------------------------
r158739 | jsm28 | 2010-04-26 10:04:01 -0700 (Mon, 26 Apr 2010) | 2 lines
Changed paths:
   M /trunk/gcc/po/ChangeLog
   M /trunk/gcc/po/sv.po

	* sv.po: Update.

------------------------------------------------------------------------
r158741 | ian | 2010-04-26 10:27:35 -0700 (Mon, 26 Apr 2010) | 2 lines
Changed paths:
   M /trunk/include/ChangeLog

ChangeLog fixes.  (Changes to ChangeLog do not get a ChangeLog entry).

------------------------------------------------------------------------

For more information, see <http://gcc.gnu.org/regtest/HEAD/>.

-------------- next part --------------
checking for --enable-version-specific-runtime-libs... no
checking for a BSD-compatible install... /usr/bin/install -c
checking for gawk... gawk
checking build system type... powerpc-apple-darwin9.8.0
checking host system type... powerpc-apple-darwin9.8.0
checking for powerpc-apple-darwin9.8.0-ar... ar
checking for powerpc-apple-darwin9.8.0-lipo... lipo
checking for powerpc-apple-darwin9.8.0-nm... /Users/regress/tbox/native/build/./gcc/nm
checking for powerpc-apple-darwin9.8.0-ranlib... ranlib -c
checking for powerpc-apple-darwin9.8.0-strip... strip
checking whether ln -s works... yes
checking for powerpc-apple-darwin9.8.0-gcc... /Users/regress/tbox/native/build/./gcc/xgcc -B/Users/regress/tbox/native/build/./gcc/ -B/Users/regress/tbox/objs/powerpc-apple-darwin9.8.0/bin/ -B/Users/regress/tbox/objs/powerpc-apple-darwin9.8.0/lib/ -isystem /Users/regress/tbox/objs/powerpc-apple-darwin9.8.0/include -isystem /Users/regress/tbox/objs/powerpc-apple-darwin9.8.0/sys-include   
checking for suffix of object files... configure: error: in `/Users/regress/tbox/native/build/powerpc-apple-darwin9.8.0/libgcc':
configure: error: cannot compute suffix of object files: cannot compile
See `config.log' for more details.
make[2]: *** [configure-stage2-target-libgcc] Error 1
make[1]: *** [stage2-bubble] Error 2
make: *** [bootstrap] Error 2
+ '[' -s .bad_compare ']'
+ exit 1
-------------- next part --------------

-- 
Geoffrey Keating <geoffk@apple.com> 
(via an automated GCC regression-testing script.)


More information about the Gcc-regression mailing list