GCC build failure, HEAD@158730 on native

regress regress@apple.com
Mon Apr 26 13:01:00 GMT 2010


With your recent patch, GCC HEAD revision 158730 had problems on:
native: build (about the same as the previous build)
Attached is build output for those targets.
The previous build was of revision 158722.

Log information for changes since the last build:
------------------------------------------------------------------------
r158723 | rguenth | 2010-04-26 02:19:24 -0700 (Mon, 26 Apr 2010) | 8 lines
Changed paths:
   M /trunk/gcc/ChangeLog
   M /trunk/gcc/gimple.c
   M /trunk/gcc/testsuite/ChangeLog
   A /trunk/gcc/testsuite/g++.dg/lto/20100423-3_0.C

2010-04-26  Richard Guenther  <rguenther@suse.de>

	PR lto/43080
	* gimple.c (gimple_decl_printable_name): Deal gracefully
	with a NULL DECL_NAME.

	* g++.dg/lto/20100423-3_0.C: New testcase.

------------------------------------------------------------------------
r158724 | hubicka | 2010-04-26 02:52:05 -0700 (Mon, 26 Apr 2010) | 2 lines
Changed paths:
   M /trunk/gcc/ChangeLog
   M /trunk/gcc/cgraphunit.c

	* cgraphunit.c (cgraph_copy_node_for_versioning): Fix profile updating.

------------------------------------------------------------------------
r158727 | jiez | 2010-04-26 03:59:34 -0700 (Mon, 26 Apr 2010) | 11 lines
Changed paths:
   M /trunk/gcc/ChangeLog
   M /trunk/gcc/testsuite/ChangeLog
   A /trunk/gcc/testsuite/gcc.dg/Warray-bounds-8.c
   M /trunk/gcc/tree-vrp.c

	PR tree-optimization/43833
	* tree-vrp.c (range_int_cst_p): New.
	(range_int_cst_singleton_p): New.
	(extract_range_from_binary_expr): Optimize BIT_AND_EXPR case
	when both operands are constants.  Use range_int_cst_p in
	BIT_IOR_EXPR case.

	testsuite/
	PR tree-optimization/43833
	gcc.dg/Warray-bounds-8.c: New test case.

------------------------------------------------------------------------
r158729 | rguenth | 2010-04-26 04:03:59 -0700 (Mon, 26 Apr 2010) | 6 lines
Changed paths:
   M /trunk/gcc/lto/ChangeLog
   M /trunk/gcc/lto/lto.c
   M /trunk/gcc/testsuite/ChangeLog
   A /trunk/gcc/testsuite/gcc.dg/lto/20100426_0.c

2010-04-26  Richard Guenther  <rguenther@suse.de>

	* lto.c (lto_fixup_type): Deal with non-type TYPE_CONTEXT.

	* gcc.dg/lto/20100426_0.c: New testcase.

------------------------------------------------------------------------

For more information, see <http://gcc.gnu.org/regtest/HEAD/>.

-------------- next part --------------
checking for --enable-version-specific-runtime-libs... no
checking for a BSD-compatible install... /usr/bin/install -c
checking for gawk... gawk
checking build system type... powerpc-apple-darwin9.8.0
checking host system type... powerpc-apple-darwin9.8.0
checking for powerpc-apple-darwin9.8.0-ar... ar
checking for powerpc-apple-darwin9.8.0-lipo... lipo
checking for powerpc-apple-darwin9.8.0-nm... /Users/regress/tbox/native/build/./gcc/nm
checking for powerpc-apple-darwin9.8.0-ranlib... ranlib -c
checking for powerpc-apple-darwin9.8.0-strip... strip
checking whether ln -s works... yes
checking for powerpc-apple-darwin9.8.0-gcc... /Users/regress/tbox/native/build/./gcc/xgcc -B/Users/regress/tbox/native/build/./gcc/ -B/Users/regress/tbox/objs/powerpc-apple-darwin9.8.0/bin/ -B/Users/regress/tbox/objs/powerpc-apple-darwin9.8.0/lib/ -isystem /Users/regress/tbox/objs/powerpc-apple-darwin9.8.0/include -isystem /Users/regress/tbox/objs/powerpc-apple-darwin9.8.0/sys-include   
checking for suffix of object files... configure: error: in `/Users/regress/tbox/native/build/powerpc-apple-darwin9.8.0/libgcc':
configure: error: cannot compute suffix of object files: cannot compile
See `config.log' for more details.
make[2]: *** [configure-stage2-target-libgcc] Error 1
make[1]: *** [stage2-bubble] Error 2
make: *** [bootstrap] Error 2
+ '[' -s .bad_compare ']'
+ exit 1
-------------- next part --------------

-- 
Geoffrey Keating <geoffk@apple.com> 
(via an automated GCC regression-testing script.)


More information about the Gcc-regression mailing list